libcap-ng-static-x86_64-unknown-linux-musl-0.9.5
checks.x86_64-linux.package-kexec
· build #424
· raw
1structuredAttrs is enabled
unpackPhase
2unpacking source archive /nix/store/1ms6h943w9p8whx8m71wzfd6bczn61ff-source3source root is sourceautoreconfPhase
4autoreconf: export WARNINGS=5autoreconf: Entering directory '.'6autoreconf: configure.ac: no obvious need to run autopoint7autoreconf: running: aclocal --force -I m48autoreconf: configure.ac: tracing9autoreconf: running: libtoolize --copy --force10libtoolize: putting auxiliary files in '.'.11libtoolize: copying file './ltmain.sh'12libtoolize: putting macros in AC_CONFIG_MACRO_DIRS, 'm4'.13libtoolize: copying file 'm4/libtool.m4'14libtoolize: copying file 'm4/ltoptions.m4'15libtoolize: copying file 'm4/ltsugar.m4'16libtoolize: copying file 'm4/ltversion.m4'17libtoolize: copying file 'm4/lt~obsolete.m4'18autoreconf: configure.ac: not using Intltool19autoreconf: configure.ac: not using Gtkdoc20autoreconf: configure.ac: no need to run autopoint (confirmed)21autoreconf: running: aclocal --force -I m422autoreconf: running: /nix/store/khvvqawiqhcz4i4frnxn7wjxchps7wj5-autoconf-2.73/bin/autoconf --force23autoreconf: running: /nix/store/khvvqawiqhcz4i4frnxn7wjxchps7wj5-autoconf-2.73/bin/autoheader --force24autoreconf: running: automake --add-missing --copy --force-missing25configure.ac:41: installing './compile'26configure.ac:39: installing './config.guess'27configure.ac:39: installing './config.sub'28configure.ac:40: installing './install-sh'29configure.ac:40: installing './missing'30bindings/python3/Makefile.am: installing './depcomp'31bindings/python3/Makefile.am:30: installing './py-compile'32parallel-tests: installing './test-driver'33utils/cap-audit/test/Makefile.am:24: warning: source file '${top_srcdir}/utils/cap-audit/cap_audit_event.c' is in a subdirectory,34utils/cap-audit/test/Makefile.am:24: but option 'subdir-objects' is disabled35automake: warning: possible forward-incompatibility.36automake: At least one source file is in a subdirectory, but the 'subdir-objects'37automake: automake option hasn't been enabled. For now, the corresponding output38automake: object file(s) will be placed in the top-level directory. However, this39automake: behavior may change in a future Automake major version, with object40automake: files being placed in the same subdirectory as the corresponding sources.41automake: You are advised to start using 'subdir-objects' option throughout your42automake: project, to avoid future incompatibility.43utils/cap-audit/test/Makefile.am:24: warning: source file '${top_srcdir}/utils/cap-audit/cap_audit_analyze.c' is in a subdirectory,44utils/cap-audit/test/Makefile.am:24: but option 'subdir-objects' is disabled45utils/cap-audit/test/Makefile.am:24: warning: source file '${top_srcdir}/utils/cap-audit/cap_audit_capset.c' is in a subdirectory,46utils/cap-audit/test/Makefile.am:24: but option 'subdir-objects' is disabled47utils/cap-audit/test/Makefile.am:24: warning: source file '${top_srcdir}/utils/cap-audit/cap_audit_outcome.c' is in a subdirectory,48utils/cap-audit/test/Makefile.am:24: but option 'subdir-objects' is disabled49utils/cap-audit/test/Makefile.am:29: warning: source file '${top_srcdir}/utils/cap-audit/cap_audit_event.c' is in a subdirectory,50utils/cap-audit/test/Makefile.am:29: but option 'subdir-objects' is disabled51utils/cap-audit/test/Makefile.am:29: warning: source file '${top_srcdir}/utils/cap-audit/cap_audit_analyze.c' is in a subdirectory,52utils/cap-audit/test/Makefile.am:29: but option 'subdir-objects' is disabled53utils/cap-audit/test/Makefile.am:29: warning: source file '${top_srcdir}/utils/cap-audit/cap_audit_capset.c' is in a subdirectory,54utils/cap-audit/test/Makefile.am:29: but option 'subdir-objects' is disabled55utils/cap-audit/test/Makefile.am:29: warning: source file '${top_srcdir}/utils/cap-audit/cap_audit_json.c' is in a subdirectory,56utils/cap-audit/test/Makefile.am:29: but option 'subdir-objects' is disabled57utils/cap-audit/test/Makefile.am:29: warning: source file '${top_srcdir}/utils/cap-audit/cap_audit_outcome.c' is in a subdirectory,58utils/cap-audit/test/Makefile.am:29: but option 'subdir-objects' is disabled59utils/cap-audit/test/Makefile.am:29: warning: source file '${top_srcdir}/utils/cap-audit/cap_audit_yaml.c' is in a subdirectory,60utils/cap-audit/test/Makefile.am:29: but option 'subdir-objects' is disabled61utils/cap-audit/test/Makefile.am:18: warning: source file '${top_srcdir}/utils/cap-audit/cap_audit_path.c' is in a subdirectory,62utils/cap-audit/test/Makefile.am:18: but option 'subdir-objects' is disabled63utils/cap-audit/test/Makefile.am:37: warning: source file '${top_srcdir}/utils/cap-audit/cap_audit_analyze.c' is in a subdirectory,64utils/cap-audit/test/Makefile.am:37: but option 'subdir-objects' is disabled65utils/cap-audit/test/Makefile.am:37: warning: source file '${top_srcdir}/utils/cap-audit/cap_audit_capset.c' is in a subdirectory,66utils/cap-audit/test/Makefile.am:37: but option 'subdir-objects' is disabled67utils/cap-audit/test/Makefile.am:37: warning: source file '${top_srcdir}/utils/cap-audit/cap_audit_outcome.c' is in a subdirectory,68utils/cap-audit/test/Makefile.am:37: but option 'subdir-objects' is disabled69utils/cap-audit/test/Makefile.am:41: warning: source file '${top_srcdir}/utils/cap-audit/cap_audit_service.c' is in a subdirectory,70utils/cap-audit/test/Makefile.am:41: but option 'subdir-objects' is disabled71utils/cap-audit/test/Makefile.am:15: warning: source file '${top_srcdir}/utils/cap-audit/classify_app.c' is in a subdirectory,72utils/cap-audit/test/Makefile.am:15: but option 'subdir-objects' is disabled73utils/test/Makefile.am:18: warning: source file '${top_srcdir}/utils/pscap.c' is in a subdirectory,74utils/test/Makefile.am:18: but option 'subdir-objects' is disabled75utils/test/Makefile.am:18: warning: source file '${top_srcdir}/utils/netcap.c' is in a subdirectory,76utils/test/Makefile.am:18: but option 'subdir-objects' is disabled77utils/test/Makefile.am:18: warning: source file '${top_srcdir}/utils/proc-account.c' is in a subdirectory,78utils/test/Makefile.am:18: but option 'subdir-objects' is disabled79utils/test/Makefile.am:18: warning: source file '${top_srcdir}/utils/proc-llist.c' is in a subdirectory,80utils/test/Makefile.am:18: but option 'subdir-objects' is disabled81utils/test/Makefile.am:18: warning: source file '${top_srcdir}/utils/proc-output.c' is in a subdirectory,82utils/test/Makefile.am:18: but option 'subdir-objects' is disabled83utils/test/Makefile.am:18: warning: source file '${top_srcdir}/utils/proc-sanitize.c' is in a subdirectory,84utils/test/Makefile.am:18: but option 'subdir-objects' is disabled85utils/test/Makefile.am:13: warning: source file '${top_srcdir}/utils/filecap-path.c' is in a subdirectory,86utils/test/Makefile.am:13: but option 'subdir-objects' is disabled87utils/test/Makefile.am:13: warning: source file '${top_srcdir}/utils/proc-account.c' is in a subdirectory,88utils/test/Makefile.am:13: but option 'subdir-objects' is disabled89utils/test/Makefile.am:13: warning: source file '${top_srcdir}/utils/proc-status.c' is in a subdirectory,90utils/test/Makefile.am:13: but option 'subdir-objects' is disabled91autoreconf: configure.ac: not running make: --make not given92autoreconf: Leaving directory '.'updateAutotoolsGnuConfigScriptsPhase
93Updating Autotools / GNU config script to a newer upstream version: ./config.sub94Updating Autotools / GNU config script to a newer upstream version: ./config.guess95Updating Autotools / GNU config script to a newer upstream version: ./config.sub96Updating Autotools / GNU config script to a newer upstream version: ./config.guessconfigurePhase
97fixing libtool script ./ltmain.sh98./configure99patching script interpreter paths in ./configure100./configure: interpreter directive changed from "#! /bin/sh" to "/nix/store/svx59425zxp552p2b8gm11qj5r09b56i-bash-5.3p15/bin/sh"101configure flags: --disable-dependency-tracking --prefix=/nix/store/80hfc2q0rq7zhw52llpdzasjwazd54kn-libcap-ng-static-x86_64-unknown-linux-musl-0.9.5 --bindir=/nix/store/80hfc2q0rq7zhw52llpdzasjwazd54kn-libcap-ng-static-x86_64-unknown-linux-musl-0.9.5/bin --sbindir=/nix/store/80hfc2q0rq7zhw52llpdzasjwazd54kn-libcap-ng-static-x86_64-unknown-linux-musl-0.9.5/sbin --includedir=/nix/store/34sqwbj5fhhaaka8zsg5zj9f0xirlqa7-libcap-ng-static-x86_64-unknown-linux-musl-0.9.5-dev/include --mandir=/nix/store/lhpgq61sf0fpmpmzzj2yjy9ycmdm14mf-libcap-ng-static-x86_64-unknown-linux-musl-0.9.5-man/share/man --infodir=/nix/store/80hfc2q0rq7zhw52llpdzasjwazd54kn-libcap-ng-static-x86_64-unknown-linux-musl-0.9.5/share/info --docdir=/nix/store/80hfc2q0rq7zhw52llpdzasjwazd54kn-libcap-ng-static-x86_64-unknown-linux-musl-0.9.5/share/doc/libcap-ng --libdir=/nix/store/80hfc2q0rq7zhw52llpdzasjwazd54kn-libcap-ng-static-x86_64-unknown-linux-musl-0.9.5/lib --libexecdir=/nix/store/80hfc2q0rq7zhw52llpdzasjwazd54kn-libcap-ng-static-x86_64-unknown-linux-musl-0.9.5/libexec --localedir=/nix/store/80hfc2q0rq7zhw52llpdzasjwazd54kn-libcap-ng-static-x86_64-unknown-linux-musl-0.9.5/share/locale --without-python --with-capability_header=\'/nix/store/vqvgrzwwpxwckalbxcl90wj05zx1xryf-linux-headers-static-7.2/include/linux/capability.h\' --enable-static --disable-shared --disable-shared --build=x86_64-unknown-linux-gnu --host=x86_64-unknown-linux-musl102Configuring libcap-ng103checking build system type... x86_64-unknown-linux-gnu104checking host system type... x86_64-unknown-linux-musl105checking target system type... x86_64-unknown-linux-musl106checking for a BSD-compatible install... /nix/store/xjl7p8dvyk2j53kqf7f43kdj4ypbxz7g-coreutils-9.11/bin/install -c107checking whether sleep supports fractional seconds... yes108checking filesystem timestamp resolution... 0.01109checking whether build environment is sane... yes110checking for x86_64-unknown-linux-musl-strip... x86_64-unknown-linux-musl-strip111checking for a race-free mkdir -p... /nix/store/xjl7p8dvyk2j53kqf7f43kdj4ypbxz7g-coreutils-9.11/bin/mkdir -p112checking for gawk... gawk113checking whether make sets $(MAKE)... yes114checking whether make supports nested variables... yes115checking xargs -n works... yes116checking whether UID '1000' is supported by ustar format... yes117checking whether GID '100' is supported by ustar format... yes118checking how to create a ustar tar archive... gnutar119checking how to print strings... printf120checking whether make supports the include directive... yes (GNU style)121checking for x86_64-unknown-linux-musl-gcc... x86_64-unknown-linux-musl-gcc122checking whether the C compiler works... yes123checking for C compiler default output file name... a.out124checking for suffix of executables... 125checking whether we are cross compiling... yes126checking for suffix of object files... o127checking whether the compiler supports GNU C... yes128checking whether x86_64-unknown-linux-musl-gcc accepts -g... yes129checking for x86_64-unknown-linux-musl-gcc option to enable C23 features... unsupported130checking for x86_64-unknown-linux-musl-gcc option to enable C11 features... none needed131checking whether x86_64-unknown-linux-musl-gcc understands -c and -o together... yes132checking dependency style of x86_64-unknown-linux-musl-gcc... none133checking for a sed that does not truncate output... /nix/store/qf2wzyq4irhgyhnq3s2hz0ldjq3w8a3x-gnused-4.10/bin/sed134checking for grep that handles long lines and -e... /nix/store/xmvbzzxm5snla5a2cyfhm7hjy9bifx7n-gnugrep-3.12/bin/grep135checking for egrep... /nix/store/xmvbzzxm5snla5a2cyfhm7hjy9bifx7n-gnugrep-3.12/bin/grep -E136checking for fgrep... /nix/store/xmvbzzxm5snla5a2cyfhm7hjy9bifx7n-gnugrep-3.12/bin/grep -F137checking for ld used by x86_64-unknown-linux-musl-gcc... x86_64-unknown-linux-musl-ld138checking if the linker (x86_64-unknown-linux-musl-ld) is GNU ld... yes139checking for BSD- or MS-compatible name lister (nm)... x86_64-unknown-linux-musl-nm140checking the name lister (x86_64-unknown-linux-musl-nm) interface... BSD nm141checking whether ln -s works... yes142checking the maximum length of command line arguments... 32768143checking how to convert x86_64-unknown-linux-gnu file names to x86_64-unknown-linux-musl format... func_convert_file_noop144checking how to convert x86_64-unknown-linux-gnu file names to toolchain format... func_convert_file_noop145checking for x86_64-unknown-linux-musl-ld option to reload object files... -r146checking for file... file147checking for x86_64-unknown-linux-musl-objdump... x86_64-unknown-linux-musl-objdump148checking how to recognize dependent libraries... (cached) pass_all149checking for x86_64-unknown-linux-musl-dlltool... no150checking for dlltool... no151checking how to associate runtime and link libraries... printf %s\n152checking for x86_64-unknown-linux-musl-ranlib... x86_64-unknown-linux-musl-ranlib153checking for x86_64-unknown-linux-musl-ar... x86_64-unknown-linux-musl-ar154checking for archiver @FILE support... @155checking for x86_64-unknown-linux-musl-strip... (cached) x86_64-unknown-linux-musl-strip156checking command to parse x86_64-unknown-linux-musl-nm output from x86_64-unknown-linux-musl-gcc object... ok157checking for sysroot... no158checking for a working dd... /nix/store/xjl7p8dvyk2j53kqf7f43kdj4ypbxz7g-coreutils-9.11/bin/dd159checking how to truncate binary pipes... /nix/store/xjl7p8dvyk2j53kqf7f43kdj4ypbxz7g-coreutils-9.11/bin/dd bs=4096 count=1160checking for x86_64-unknown-linux-musl-mt... no161checking for mt... no162checking if : is a manifest tool... no163checking for stdio.h... yes164checking for stdlib.h... yes165checking for string.h... yes166checking for inttypes.h... yes167checking for stdint.h... yes168checking for strings.h... yes169checking for sys/stat.h... yes170checking for sys/types.h... yes171checking for unistd.h... yes172checking for dlfcn.h... yes173checking which variant of shared library versioning to provide... (default) aix174checking for objdir... .libs175checking if x86_64-unknown-linux-musl-gcc supports -fno-rtti -fno-exceptions... no176checking for x86_64-unknown-linux-musl-gcc option to produce PIC... -fPIC -DPIC177checking if x86_64-unknown-linux-musl-gcc PIC flag -fPIC -DPIC works... yes178checking if x86_64-unknown-linux-musl-gcc static flag -static works... yes179checking if x86_64-unknown-linux-musl-gcc supports -c -o file.o... yes180checking if x86_64-unknown-linux-musl-gcc supports -c -o file.o... (cached) yes181checking whether the x86_64-unknown-linux-musl-gcc linker (x86_64-unknown-linux-musl-ld -m elf_x86_64) supports shared libraries... yes182checking dynamic linker characteristics... GNU/Linux ld.so183checking how to hardcode library paths into programs... immediate184checking whether stripping libraries is possible... yes185checking if libtool supports shared libraries... yes186checking whether to build shared libraries... no187checking whether to build static libraries... yes188checking pkg-config is at least version 0.9.0... yes189.190Checking for programs191checking for x86_64-unknown-linux-musl-gcc... (cached) x86_64-unknown-linux-musl-gcc192checking whether the compiler supports GNU C... (cached) yes193checking whether x86_64-unknown-linux-musl-gcc accepts -g... (cached) yes194checking for x86_64-unknown-linux-musl-gcc option to enable C23 features... (cached) unsupported195checking for x86_64-unknown-linux-musl-gcc option to enable C11 features... (cached) none needed196checking whether x86_64-unknown-linux-musl-gcc understands -c and -o together... (cached) yes197checking dependency style of x86_64-unknown-linux-musl-gcc... (cached) none198checking for gawk... (cached) gawk199checking for __atomic_load_n... yes200checking enable-deprecated... no201.202Checking for header files203checking for linux/capability.h... yes204checking for sys/xattr.h... yes205checking for linux/securebits.h... yes206checking for bluetooth/bluetooth.h... no207checking for bluetooth/hci.h... no208checking for linux/inet_diag.h... yes209checking for linux/netlink.h... yes210checking for linux/sock_diag.h... yes211checking for sys/socket.h... yes212checking for linux/vm_sockets.h... yes213checking for linux/vm_sockets_diag.h... yes214checking for pthread.h... yes215checking for library containing pthread_atfork... none required216checking for sys/vfs.h... yes217checking for linux/magic.h... yes218configure: netcap advanced mode enabled219checking __attr_dealloc_free support... no220checking for -Wformat-truncation... yes221checking for sys/syscall.h... yes222checking for x86_64-unknown-linux-musl-gcc options to detect undeclared functions... none needed223checking for x86_64-unknown-linux-musl-gcc options to ignore future-version functions... none needed224checking whether PR_CAP_AMBIENT is declared... yes225checking whether VFS_CAP_REVISION_2 is declared... yes226checking whether VFS_CAP_REVISION_3 is declared... yes227checking whether CAP_EPOLLWAKEUP is declared... no228checking whether CAP_WAKE_ALARM is declared... yes229checking whether CAP_BLOCK_SUSPEND is declared... yes230checking whether CAP_AUDIT_READ is declared... yes231checking whether CAP_PERFMON is declared... yes232checking whether CAP_BPF is declared... yes233checking whether CAP_CHECKPOINT_RESTORE is declared... yes234checking whether to create python3 bindings... no235checking that generated files are newer than configure... done236configure: creating ./config.status237config.status: creating Makefile238config.status: creating src/Makefile239config.status: creating src/libcap-ng.pc240config.status: creating src/test/Makefile241config.status: creating bindings/Makefile242config.status: creating bindings/python3/Makefile243config.status: creating bindings/src/Makefile244config.status: creating bindings/python3/test/Makefile245config.status: creating bindings/test/Makefile246config.status: creating utils/Makefile247config.status: creating utils/test/Makefile248config.status: creating utils/cap-audit/Makefile249config.status: creating utils/cap-audit/test/Makefile250config.status: creating m4/Makefile251config.status: creating docs/Makefile252config.status: creating config.h253config.status: executing depfiles commands254config.status: executing libtool commands255config.status: executing utils/netcap.8 commands256.257258259 libcap-ng Version: 0.9.5260 Target: x86_64-unknown-linux-musl261 Installation prefix: /nix/store/80hfc2q0rq7zhw52llpdzasjwazd54kn-libcap-ng-static-x86_64-unknown-linux-musl-0.9.5262 Build Kernel: 6.18.49263 Compiler: x86_64-unknown-linux-musl-gcc264 Compiler flags:265 -g -O2266 __attr_dealloc_free support: no267 netcap advanced mode: enabled268 netcap VSOCK support: enabled269 cap-audit vmlinux.h: n/a (cap-audit disabled)270 buildPhase
271build flags: -j48 SHELL=/nix/store/svx59425zxp552p2b8gm11qj5r09b56i-bash-5.3p15/bin/bash272make all-recursive273make[1]: Entering directory '/build/source'274Making all in src275make[2]: Entering directory '/build/source/src'276Making all in test277make[3]: Entering directory '/build/source/src/test'278make[3]: Nothing to be done for 'all'.279make[3]: Leaving directory '/build/source/src/test'280make[3]: Entering directory '/build/source/src'281/nix/store/svx59425zxp552p2b8gm11qj5r09b56i-bash-5.3p15/bin/bash ../libtool --tag=CC --mode=compile x86_64-unknown-linux-musl-gcc -DHAVE_CONFIG_H -I. -I.. -I. -I.. -fPIC -DPIC -W -Wall -Wshadow -Wno-format-truncation -Wundef -D_GNU_SOURCE -g -O2 -c -o cap-ng.lo cap-ng.c282/nix/store/svx59425zxp552p2b8gm11qj5r09b56i-bash-5.3p15/bin/bash ../libtool --tag=CC --mode=compile x86_64-unknown-linux-musl-gcc -DHAVE_CONFIG_H -I. -I.. -I. -I.. -fPIC -DPIC -W -Wall -Wshadow -Wno-format-truncation -Wundef -D_GNU_SOURCE -g -O2 -c -o lookup_table.lo lookup_table.c283/nix/store/svx59425zxp552p2b8gm11qj5r09b56i-bash-5.3p15/bin/bash ../libtool --tag=CC --mode=compile x86_64-unknown-linux-musl-gcc -DHAVE_CONFIG_H -I. -I.. -I. -I.. -fPIC -DPIC -W -Wall -Wshadow -Wno-format-truncation -Wundef -D_GNU_SOURCE -g -O2 -c -o libdrop_ambient.lo libdrop_ambient.c284libtool: compile: x86_64-unknown-linux-musl-gcc -DHAVE_CONFIG_H -I. -I.. -I. -I.. -fPIC -DPIC -W -Wall -Wshadow -Wno-format-truncation -Wundef -D_GNU_SOURCE -g -O2 -c cap-ng.c -o cap-ng.o285libtool: compile: x86_64-unknown-linux-musl-gcc -DHAVE_CONFIG_H -I. -I.. -I. -I.. -fPIC -DPIC -W -Wall -Wshadow -Wno-format-truncation -Wundef -D_GNU_SOURCE -g -O2 -c libdrop_ambient.c -o libdrop_ambient.o286libtool: compile: x86_64-unknown-linux-musl-gcc -DHAVE_CONFIG_H -I. -I.. -I. -I.. -fPIC -DPIC -W -Wall -Wshadow -Wno-format-truncation -Wundef -D_GNU_SOURCE -g -O2 -c lookup_table.c -o lookup_table.o287/nix/store/svx59425zxp552p2b8gm11qj5r09b56i-bash-5.3p15/bin/bash ../libtool --tag=CC --mode=link x86_64-unknown-linux-musl-gcc -fPIC -DPIC -W -Wall -Wshadow -Wno-format-truncation -Wundef -D_GNU_SOURCE -g -O2 -o libdrop_ambient.la -rpath /nix/store/80hfc2q0rq7zhw52llpdzasjwazd54kn-libcap-ng-static-x86_64-unknown-linux-musl-0.9.5/lib libdrop_ambient.lo 288libtool: link: x86_64-unknown-linux-musl-ar cr .libs/libdrop_ambient.a libdrop_ambient.o289libtool: link: x86_64-unknown-linux-musl-ranlib .libs/libdrop_ambient.a290libtool: link: ( cd ".libs" && rm -f "libdrop_ambient.la" && ln -s "../libdrop_ambient.la" "libdrop_ambient.la" )291/nix/store/svx59425zxp552p2b8gm11qj5r09b56i-bash-5.3p15/bin/bash ../libtool --tag=CC --mode=link x86_64-unknown-linux-musl-gcc -fPIC -DPIC -W -Wall -Wshadow -Wno-format-truncation -Wundef -D_GNU_SOURCE -g -O2 -Wl,-z,relro -Wl,-z,nodelete -o libcap-ng.la -rpath /nix/store/80hfc2q0rq7zhw52llpdzasjwazd54kn-libcap-ng-static-x86_64-unknown-linux-musl-0.9.5/lib cap-ng.lo lookup_table.lo 292libtool: link: x86_64-unknown-linux-musl-ar cr .libs/libcap-ng.a cap-ng.o lookup_table.o293libtool: link: x86_64-unknown-linux-musl-ranlib .libs/libcap-ng.a294libtool: link: ( cd ".libs" && rm -f "libcap-ng.la" && ln -s "../libcap-ng.la" "libcap-ng.la" )295make[3]: Leaving directory '/build/source/src'296make[2]: Leaving directory '/build/source/src'297Making all in utils298make[2]: Entering directory '/build/source/utils'299Making all in test300make[3]: Entering directory '/build/source/utils/test'301make[3]: Nothing to be done for 'all'.302make[3]: Leaving directory '/build/source/utils/test'303Making all in cap-audit304make[3]: Entering directory '/build/source/utils/cap-audit'305make all-recursive306make[4]: Entering directory '/build/source/utils/cap-audit'307Making all in test308make[5]: Entering directory '/build/source/utils/cap-audit/test'309make[5]: Nothing to be done for 'all'.310make[5]: Leaving directory '/build/source/utils/cap-audit/test'311make[5]: Entering directory '/build/source/utils/cap-audit'312make[5]: Nothing to be done for 'all-am'.313make[5]: Leaving directory '/build/source/utils/cap-audit'314make[4]: Leaving directory '/build/source/utils/cap-audit'315make[3]: Leaving directory '/build/source/utils/cap-audit'316make[3]: Entering directory '/build/source/utils'317x86_64-unknown-linux-musl-gcc -DHAVE_CONFIG_H -I. -I.. -I.. -I../src -W -Wall -Wshadow -Wno-format-truncation -Wundef -D_GNU_SOURCE -g -O2 -c -o pscap.o pscap.c318x86_64-unknown-linux-musl-gcc -DHAVE_CONFIG_H -I. -I.. -I.. -I../src -W -Wall -Wshadow -Wno-format-truncation -Wundef -D_GNU_SOURCE -g -O2 -c -o proc-account.o proc-account.c319x86_64-unknown-linux-musl-gcc -DHAVE_CONFIG_H -I. -I.. -I.. -I../src -W -Wall -Wshadow -Wno-format-truncation -Wundef -D_GNU_SOURCE -g -O2 -c -o proc-output.o proc-output.c320x86_64-unknown-linux-musl-gcc -DHAVE_CONFIG_H -I. -I.. -I.. -I../src -W -Wall -Wshadow -Wno-format-truncation -Wundef -D_GNU_SOURCE -g -O2 -c -o proc-sanitize.o proc-sanitize.c321x86_64-unknown-linux-musl-gcc -DHAVE_CONFIG_H -I. -I.. -I.. -I../src -W -Wall -Wshadow -Wno-format-truncation -Wundef -D_GNU_SOURCE -g -O2 -c -o proc-status.o proc-status.c322x86_64-unknown-linux-musl-gcc -DHAVE_CONFIG_H -I. -I.. -I.. -I../src -W -Wall -Wshadow -Wno-format-truncation -Wundef -D_GNU_SOURCE -g -O2 -c -o netcap.o netcap.c323x86_64-unknown-linux-musl-gcc -DHAVE_CONFIG_H -I. -I.. -I.. -I../src -W -Wall -Wshadow -Wno-format-truncation -Wundef -D_GNU_SOURCE -g -O2 -c -o proc-llist.o proc-llist.c324x86_64-unknown-linux-musl-gcc -DHAVE_CONFIG_H -I. -I.. -I.. -I../src -W -Wall -Wshadow -Wno-format-truncation -Wundef -D_GNU_SOURCE -g -O2 -c -o netcap-advanced.o netcap-advanced.c325x86_64-unknown-linux-musl-gcc -DHAVE_CONFIG_H -I. -I.. -I.. -I../src -W -Wall -Wshadow -Wno-format-truncation -Wundef -D_GNU_SOURCE -g -O2 -c -o filecap.o filecap.c326x86_64-unknown-linux-musl-gcc -DHAVE_CONFIG_H -I. -I.. -I.. -I../src -W -Wall -Wshadow -Wno-format-truncation -Wundef -D_GNU_SOURCE -g -O2 -c -o filecap-path.o filecap-path.c327In file included from gcc-attributes.h:7,328 from proc-llist.h:30,329 from proc-llist.c:28:330/nix/store/71ydp3bkg9c37kc3hngij1hyg7m61gvw-x86_64-unknown-linux-musl-gcc-15.3.0/x86_64-unknown-linux-musl/sys-include/sys/cdefs.h:1:2: warning: #warning usage of non-standard #include <sys/cdefs.h> is deprecated [-Wcpp]331 1 | #warning usage of non-standard #include <sys/cdefs.h> is deprecated332 | ^~~~~~~333In file included from gcc-attributes.h:7,334 from proc-status.h:16,335 from proc-status.c:16:336/nix/store/71ydp3bkg9c37kc3hngij1hyg7m61gvw-x86_64-unknown-linux-musl-gcc-15.3.0/x86_64-unknown-linux-musl/sys-include/sys/cdefs.h:1:2: warning: #warning usage of non-standard #include <sys/cdefs.h> is deprecated [-Wcpp]337 1 | #warning usage of non-standard #include <sys/cdefs.h> is deprecated338 | ^~~~~~~339In file included from gcc-attributes.h:7,340 from proc-account.h:17,341 from proc-account.c:22:342/nix/store/71ydp3bkg9c37kc3hngij1hyg7m61gvw-x86_64-unknown-linux-musl-gcc-15.3.0/x86_64-unknown-linux-musl/sys-include/sys/cdefs.h:1:2: warning: #warning usage of non-standard #include <sys/cdefs.h> is deprecated [-Wcpp]343 1 | #warning usage of non-standard #include <sys/cdefs.h> is deprecated344 | ^~~~~~~345In file included from gcc-attributes.h:7,346 from filecap-path.h:15,347 from filecap-path.c:22:348/nix/store/71ydp3bkg9c37kc3hngij1hyg7m61gvw-x86_64-unknown-linux-musl-gcc-15.3.0/x86_64-unknown-linux-musl/sys-include/sys/cdefs.h:1:2: warning: #warning usage of non-standard #include <sys/cdefs.h> is deprecated [-Wcpp]349 1 | #warning usage of non-standard #include <sys/cdefs.h> is deprecated350 | ^~~~~~~351In file included from gcc-attributes.h:7,352 from proc-output.h:16,353 from proc-output.c:19:354/nix/store/71ydp3bkg9c37kc3hngij1hyg7m61gvw-x86_64-unknown-linux-musl-gcc-15.3.0/x86_64-unknown-linux-musl/sys-include/sys/cdefs.h:1:2: warning: #warning usage of non-standard #include <sys/cdefs.h> is deprecated [-Wcpp]355 1 | #warning usage of non-standard #include <sys/cdefs.h> is deprecated356 | ^~~~~~~357In file included from gcc-attributes.h:7,358 from proc-sanitize.h:28,359 from proc-sanitize.c:29:360/nix/store/71ydp3bkg9c37kc3hngij1hyg7m61gvw-x86_64-unknown-linux-musl-gcc-15.3.0/x86_64-unknown-linux-musl/sys-include/sys/cdefs.h:1:2: warning: #warning usage of non-standard #include <sys/cdefs.h> is deprecated [-Wcpp]361 1 | #warning usage of non-standard #include <sys/cdefs.h> is deprecated362 | ^~~~~~~363In file included from gcc-attributes.h:7,364 from filecap-path.h:15,365 from filecap.c:32:366/nix/store/71ydp3bkg9c37kc3hngij1hyg7m61gvw-x86_64-unknown-linux-musl-gcc-15.3.0/x86_64-unknown-linux-musl/sys-include/sys/cdefs.h:1:2: warning: #warning usage of non-standard #include <sys/cdefs.h> is deprecated [-Wcpp]367 1 | #warning usage of non-standard #include <sys/cdefs.h> is deprecated368 | ^~~~~~~369In file included from gcc-attributes.h:7,370 from proc-account.h:17,371 from pscap.c:37:372/nix/store/71ydp3bkg9c37kc3hngij1hyg7m61gvw-x86_64-unknown-linux-musl-gcc-15.3.0/x86_64-unknown-linux-musl/sys-include/sys/cdefs.h:1:2: warning: #warning usage of non-standard #include <sys/cdefs.h> is deprecated [-Wcpp]373 1 | #warning usage of non-standard #include <sys/cdefs.h> is deprecated374 | ^~~~~~~375In file included from gcc-attributes.h:7,376 from netcap-advanced.h:28,377 from netcap-advanced.c:63:378/nix/store/71ydp3bkg9c37kc3hngij1hyg7m61gvw-x86_64-unknown-linux-musl-gcc-15.3.0/x86_64-unknown-linux-musl/sys-include/sys/cdefs.h:1:2: warning: #warning usage of non-standard #include <sys/cdefs.h> is deprecated [-Wcpp]379 1 | #warning usage of non-standard #include <sys/cdefs.h> is deprecated380 | ^~~~~~~381In file included from gcc-attributes.h:7,382 from proc-account.h:17,383 from netcap.c:53:384/nix/store/71ydp3bkg9c37kc3hngij1hyg7m61gvw-x86_64-unknown-linux-musl-gcc-15.3.0/x86_64-unknown-linux-musl/sys-include/sys/cdefs.h:1:2: warning: #warning usage of non-standard #include <sys/cdefs.h> is deprecated [-Wcpp]385 1 | #warning usage of non-standard #include <sys/cdefs.h> is deprecated386 | ^~~~~~~387/nix/store/svx59425zxp552p2b8gm11qj5r09b56i-bash-5.3p15/bin/bash ../libtool --tag=CC --mode=link x86_64-unknown-linux-musl-gcc -W -Wall -Wshadow -Wno-format-truncation -Wundef -D_GNU_SOURCE -g -O2 -o filecap filecap.o filecap-path.o ../src/libcap-ng.la 388libtool: link: x86_64-unknown-linux-musl-gcc -W -Wall -Wshadow -Wno-format-truncation -Wundef -D_GNU_SOURCE -g -O2 -o filecap filecap.o filecap-path.o ../src/.libs/libcap-ng.a389/nix/store/svx59425zxp552p2b8gm11qj5r09b56i-bash-5.3p15/bin/bash ../libtool --tag=CC --mode=link x86_64-unknown-linux-musl-gcc -W -Wall -Wshadow -Wno-format-truncation -Wundef -D_GNU_SOURCE -g -O2 -o pscap pscap.o proc-account.o proc-output.o proc-sanitize.o proc-status.o ../src/libcap-ng.la 390libtool: link: x86_64-unknown-linux-musl-gcc -W -Wall -Wshadow -Wno-format-truncation -Wundef -D_GNU_SOURCE -g -O2 -o pscap pscap.o proc-account.o proc-output.o proc-sanitize.o proc-status.o ../src/.libs/libcap-ng.a391/nix/store/svx59425zxp552p2b8gm11qj5r09b56i-bash-5.3p15/bin/bash ../libtool --tag=CC --mode=link x86_64-unknown-linux-musl-gcc -W -Wall -Wshadow -Wno-format-truncation -Wundef -D_GNU_SOURCE -g -O2 -o netcap netcap.o proc-llist.o proc-account.o proc-sanitize.o netcap-advanced.o proc-output.o proc-status.o ../src/libcap-ng.la 392libtool: link: x86_64-unknown-linux-musl-gcc -W -Wall -Wshadow -Wno-format-truncation -Wundef -D_GNU_SOURCE -g -O2 -o netcap netcap.o proc-llist.o proc-account.o proc-sanitize.o netcap-advanced.o proc-output.o proc-status.o ../src/.libs/libcap-ng.a393make[3]: Leaving directory '/build/source/utils'394make[2]: Leaving directory '/build/source/utils'395Making all in m4396make[2]: Entering directory '/build/source/m4'397make[2]: Nothing to be done for 'all'.398make[2]: Leaving directory '/build/source/m4'399Making all in docs400make[2]: Entering directory '/build/source/docs'401make[2]: Nothing to be done for 'all'.402make[2]: Leaving directory '/build/source/docs'403make[2]: Entering directory '/build/source'404make[2]: Leaving directory '/build/source'405make[1]: Leaving directory '/build/source'checkPhase
406patching script interpreter paths in bindings/test bindings/python3/test407check flags: -j48 SHELL=/nix/store/svx59425zxp552p2b8gm11qj5r09b56i-bash-5.3p15/bin/bash VERBOSE=y check408Making check in src409make[1]: Entering directory '/build/source/src'410Making check in test411make[2]: Entering directory '/build/source/src/test'412make lib_test thread_test change_id_test file_caps_test securebits_test413make[3]: Entering directory '/build/source/src/test'414x86_64-unknown-linux-musl-gcc -DHAVE_CONFIG_H -I. -I../.. -I../.. -I../../src -g -O2 -c -o lib_test.o lib_test.c415x86_64-unknown-linux-musl-gcc -DHAVE_CONFIG_H -I. -I../.. -I../.. -I../../src -g -O2 -c -o thread_test.o thread_test.c416x86_64-unknown-linux-musl-gcc -DHAVE_CONFIG_H -I. -I../.. -I../.. -I../../src -g -O2 -c -o change_id_test.o change_id_test.c417x86_64-unknown-linux-musl-gcc -DHAVE_CONFIG_H -I. -I../.. -I../.. -I../../src -g -O2 -c -o file_caps_test.o file_caps_test.c418x86_64-unknown-linux-musl-gcc -DHAVE_CONFIG_H -I. -I../.. -I../.. -I../../src -g -O2 -c -o securebits_test.o securebits_test.c419/nix/store/svx59425zxp552p2b8gm11qj5r09b56i-bash-5.3p15/bin/bash ../../libtool --tag=CC --mode=link x86_64-unknown-linux-musl-gcc -g -O2 -o thread_test thread_test.o ../../src/libcap-ng.la -lpthread 420/nix/store/svx59425zxp552p2b8gm11qj5r09b56i-bash-5.3p15/bin/bash ../../libtool --tag=CC --mode=link x86_64-unknown-linux-musl-gcc -g -O2 -o securebits_test securebits_test.o ../../src/libcap-ng.la 421/nix/store/svx59425zxp552p2b8gm11qj5r09b56i-bash-5.3p15/bin/bash ../../libtool --tag=CC --mode=link x86_64-unknown-linux-musl-gcc -g -O2 -o file_caps_test file_caps_test.o ../../src/libcap-ng.la 422libtool: link: x86_64-unknown-linux-musl-gcc -g -O2 -o thread_test thread_test.o ../../src/.libs/libcap-ng.a -lpthread423/nix/store/svx59425zxp552p2b8gm11qj5r09b56i-bash-5.3p15/bin/bash ../../libtool --tag=CC --mode=link x86_64-unknown-linux-musl-gcc -g -O2 -o lib_test lib_test.o ../../src/libcap-ng.la 424libtool: link: x86_64-unknown-linux-musl-gcc -g -O2 -o securebits_test securebits_test.o ../../src/.libs/libcap-ng.a425libtool: link: x86_64-unknown-linux-musl-gcc -g -O2 -o file_caps_test file_caps_test.o ../../src/.libs/libcap-ng.a426/nix/store/60lv8wlcr99wv4ck3sk9fzcbb4jbk2n6-x86_64-unknown-linux-musl-binutils-2.46/bin/x86_64-unknown-linux-musl-ld.bfd: /nix/store/x3ga6nq5bxfnip0lz80zb2pi111y914a-musl-static-x86_64-unknown-linux-musl-1.2.6/lib/libc.a(xattr.lo): in function `fgetxattr':427(.text.fgetxattr+0x0): multiple definition of `fgetxattr'; file_caps_test.o:/build/source/src/test/file_caps_test.c:78: first defined here428/nix/store/60lv8wlcr99wv4ck3sk9fzcbb4jbk2n6-x86_64-unknown-linux-musl-binutils-2.46/bin/x86_64-unknown-linux-musl-ld.bfd: /nix/store/x3ga6nq5bxfnip0lz80zb2pi111y914a-musl-static-x86_64-unknown-linux-musl-1.2.6/lib/libc.a(xattr.lo): in function `fsetxattr':429(.text.fsetxattr+0x0): multiple definition of `fsetxattr'; file_caps_test.o:/build/source/src/test/file_caps_test.c:129: first defined here430libtool: link: x86_64-unknown-linux-musl-gcc -g -O2 -o lib_test lib_test.o ../../src/.libs/libcap-ng.a431collect2: error: ld returned 1 exit status432make[3]: *** [Makefile:634: file_caps_test] Error 1433make[3]: *** Waiting for unfinished jobs....434make[3]: Leaving directory '/build/source/src/test'435make[2]: *** [Makefile:995: check-am] Error 2436make[2]: Leaving directory '/build/source/src/test'437make[1]: *** [Makefile:622: check-recursive] Error 1438make[1]: Leaving directory '/build/source/src'439make: *** [Makefile:466: check-recursive] Error 1