SBEE-Lab/infra build #424 failed ← #423 #425 →
eval warnings
3 kinds
· 6 occurrences
- warn The option `services.journald.audit' defined in `/nix/store/…-source/modules/monitoring/audit/auditd.nix' has been renamed to `services.journald.settings.Journal.Audit'. ×4
- warn stdenv.isDarwin is deprecated, use stdenv.hostPlatform.isDarwin instead ×1
- warn stdenv.isLinux is deprecated, use stdenv.hostPlatform.isLinux instead ×1
4 failed ⚠ 2
| status | attribute | duration |
|---|---|---|
checks.x86_64-linux.nixos-rho
|
30m 50s | |
setup: error: Cannot build '/nix/store/yhqxga07wiqvv9mznkjh9kzi4rbm9jk6-X-Restart-Triggers-dbus-broker.drv'. Reason: 1 dependency failed. Output p …setup: error: Cannot build '/nix/store/yhqxga07wiqvv9mznkjh9kzi4rbm9jk6-X-Restart-Triggers-dbus-broker.drv'. Reason: 1 dependency failed. Output paths: /nix/store/xxkxwai6i2c8sz681xd2ns9lfiqssavz-X-Restart-Triggers-dbus-broker error: Cannot build '/nix/store/0bivn0cx6dc5jzwgvv65bivw4j2z9fip-unit-dbus-broker.service.drv'. Reason: 1 dependency failed. Output paths: /nix/store/3bgryg4hdhx0c2ajr6kgdmlkyy5q7awr-unit-dbus-broker.service error: Cannot build '/nix/store/y9sbdqdmlm1l2kij62lgf0l2rd58vqfd-unit-dbus-broker.service.drv'. Reason: 1 dependency failed. Output paths: /nix/store/sz4qj87365w566gvvgxr2s1j71907hwi-unit-dbus-broker.service error: Cannot build '/nix/store/kpqrnbhg8f6y8v9vz4zzz64x9imic8p2-system-units.drv'. Reason: 2 dependencies failed. Output paths: /nix/store/vbqqx89ppyjqbivd9agkwi0c5mdi7a75-system-units error: Cannot build '/nix/store/bhxa1056izwsf6lkwnyapfa8qch6kjlc-user-units.drv'. Reason: 1 dependency failed. Output paths: /nix/store/8wzjqa1knbf7fkz83yjzj5ysr8z13h7y-user-units error: Cannot build '/nix/store/v603kilgc8r5lvqcs1cmi70jz83qb3bx-etc.drv'. Reason: 5 dependencies failed. Output paths: /nix/store/7cv0qm9pcmczl5cdkswdzq2v16gzwgxz-etc error: Cannot build '/nix/store/xg653k4wbd0bmgbz3rls7y02g02g69yp-activate.drv'. Reason: 1 dependency failed. Output paths: /nix/store/4fbvkrfnjn74difzjcqwpq1gv0fgrjg8-activate error: Cannot build '/nix/store/i0dvvjvxgsfm4yqvnd5cdcbhbcsl1jd5-nixos-system-rho-26.11.20260913.fe38ffa.drv'. Reason: 3 dependencies failed. Output paths: /nix/store/fk654kcfdfywclizxdin9g6h10p63xic-nixos-system-rho-26.11.20260913.fe38ffa |
||
checks.x86_64-linux.nixos-tau
|
52m 43s | |
setup: error: Cannot build '/nix/store/xlgsxx94djgc1c6zh63p6sz7xas0q1kb-X-Restart-Triggers-dbus-broker.drv'. Reason: 1 dependency failed. Output p …setup: error: Cannot build '/nix/store/xlgsxx94djgc1c6zh63p6sz7xas0q1kb-X-Restart-Triggers-dbus-broker.drv'. Reason: 1 dependency failed. Output paths: /nix/store/s98yg048m3gzrq59kd5lcb48birr19h1-X-Restart-Triggers-dbus-broker error: Cannot build '/nix/store/a95wsp6aa8k236a8ikv76y3gkavmrqn1-unit-dbus-broker.service.drv'. Reason: 1 dependency failed. Output paths: /nix/store/0llfxh1sbn4y80rf3yygjqg159m66km0-unit-dbus-broker.service error: Cannot build '/nix/store/sj804wj9x1vgm5hpj3h17l64hq6czqqx-unit-dbus-broker.service.drv'. Reason: 1 dependency failed. Output paths: /nix/store/vg5asv0gs23sdxzcjcnlq0wd7aiif6dm-unit-dbus-broker.service error: Cannot build '/nix/store/g72f9y3hq847783ww1grmcyz0487jqj7-system-units.drv'. Reason: 2 dependencies failed. Output paths: /nix/store/0frgdlps43ic4bgxjn87dwi1sdyhw66f-system-units error: Cannot build '/nix/store/lvg4bhvv50ljhx78wyrkrrfrdsnkn64c-user-units.drv'. Reason: 1 dependency failed. Output paths: /nix/store/l9qz0682pzimz6dy7x8589cbrmf6plnl-user-units error: Cannot build '/nix/store/3shsjz3i4y4vpk18c8xkwvav6br0wccj-etc.drv'. Reason: 5 dependencies failed. Output paths: /nix/store/66f03yrys5bkjlcg3zrjkbq5ary0760k-etc error: Cannot build '/nix/store/gyiwg28gzkh97ipkh5cw2wvlspari4df-activate.drv'. Reason: 1 dependency failed. Output paths: /nix/store/jaarpq1aj4l21yz9hivd13ljrpkb5p41-activate error: Cannot build '/nix/store/sfsasx2n58ifrllrgwjy3syb865cyhg7-nixos-system-tau-26.11.20260913.fe38ffa.drv'. Reason: 3 dependencies failed. Output paths: /nix/store/i60vj2dm9ic6yfw2c0g2zshwbggiblg0-nixos-system-tau-26.11.20260913.fe38ffa |
||
checks.x86_64-linux.package-installer
|
5m 34s | |
partclone-0.3.38: | ^~ partclone.c:956:23: note: object 'buf_v2' of size 110 95 …partclone-0.3.38:
| ^~
partclone.c:956:23: note: object 'buf_v2' of size 110
956 | image_desc_v2 buf_v2;
| ^~~~~~
make[2]: Leaving directory '/build/source/src'
make[1]: *** [Makefile:413: all-recursive] Error 1
make[1]: Leaving directory '/build/source'
make: *** [Makefile:354: all] Error 2
|
||
checks.x86_64-linux.package-kexec
|
5m 22s | |
libcap-ng-static-x86_64-unknown-linux-musl-0.9.5: make[3]: *** [Makefile:634: file_caps_test] Error 1 make[3]: *** Waiting for unfinished jobs.... make[3]: Leav …libcap-ng-static-x86_64-unknown-linux-musl-0.9.5: make[3]: *** [Makefile:634: file_caps_test] Error 1 make[3]: *** Waiting for unfinished jobs.... make[3]: Leaving directory '/build/source/src/test' make[2]: *** [Makefile:995: check-am] Error 2 make[2]: Leaving directory '/build/source/src/test' make[1]: *** [Makefile:622: check-recursive] Error 1 make[1]: Leaving directory '/build/source/src' make: *** [Makefile:466: check-recursive] Error 1 |
||
2 cancelled ⚠ 2
| status | attribute | duration |
|---|---|---|
checks.x86_64-linux.nixos-eta
|
52m 10s | |
checks.x86_64-linux.nixos-psi
|
34m 38s |
17 succeeded
| status | attribute | duration |
|---|---|---|
| loading… | ||