nixbot

builds

failed partclone-0.3.38 checks.x86_64-linux.package-installer · build #424 · raw

unpackPhase
1unpacking source archive /nix/store/5ds6111n8m1p1lpiphh7994y6rprdil9-source2source root is source
autoreconfPhase
3autoreconf: export WARNINGS=4autoreconf: Entering directory '.'5autoreconf: running: autopoint --force6Copying file m4/codeset.m47Copying file m4/glibc2.m48Copying file m4/glibc21.m49Copying file m4/intdiv0.m410Copying file m4/intl.m411Copying file m4/intldir.m412Copying file m4/intmax.m413Copying file m4/inttypes-pri.m414Copying file m4/inttypes_h.m415Copying file m4/lcmessage.m416Copying file m4/lock.m417Copying file m4/longdouble.m418Copying file m4/longlong.m419Copying file m4/printf-posix.m420Copying file m4/size_max.m421Copying file m4/stdint_h.m422Copying file m4/uintmax_t.m423Copying file m4/ulonglong.m424Copying file m4/visibility.m425Copying file m4/wchar_t.m426Copying file m4/wint_t.m427Copying file m4/xsize.m428autoreconf: running: aclocal --force -I m429autoreconf: configure.ac: tracing30autoreconf: configure.ac: not using Libtool31autoreconf: configure.ac: not using Intltool32autoreconf: configure.ac: not using Gtkdoc33autoreconf: configure.ac: not running autopoint a second time34autoreconf: running: aclocal --force -I m4 -I m435autoreconf: running: /nix/store/khvvqawiqhcz4i4frnxn7wjxchps7wj5-autoconf-2.73/bin/autoconf --force36configure.ac:4: warning: The macro 'AC_TRY_LINK' is obsolete.37configure.ac:4: You should run autoupdate.38./lib/autoconf/general.m4:2976: AC_TRY_LINK is expanded from...39lib/m4sugar/m4sh.m4:689: _AS_IF_ELSE is expanded from...40lib/m4sugar/m4sh.m4:696: AS_IF is expanded from...41./lib/autoconf/general.m4:2305: AC_CACHE_VAL is expanded from...42./lib/autoconf/general.m4:2326: AC_CACHE_CHECK is expanded from...43m4/gettext.m4:367: gt_INTL_MACOSX is expanded from...44m4/gettext.m4:57: AM_GNU_GETTEXT is expanded from...45configure.ac:4: the top level46configure.ac:4: warning: The macro 'AC_TRY_LINK' is obsolete.47configure.ac:4: You should run autoupdate.48./lib/autoconf/general.m4:2976: AC_TRY_LINK is expanded from...49lib/m4sugar/m4sh.m4:689: _AS_IF_ELSE is expanded from...50lib/m4sugar/m4sh.m4:696: AS_IF is expanded from...51./lib/autoconf/general.m4:2305: AC_CACHE_VAL is expanded from...52./lib/autoconf/general.m4:2326: AC_CACHE_CHECK is expanded from...53m4/gettext.m4:57: AM_GNU_GETTEXT is expanded from...54configure.ac:4: the top level55configure.ac:4: warning: The macro 'AC_TRY_LINK' is obsolete.56configure.ac:4: You should run autoupdate.57./lib/autoconf/general.m4:2976: AC_TRY_LINK is expanded from...58lib/m4sugar/m4sh.m4:689: _AS_IF_ELSE is expanded from...59lib/m4sugar/m4sh.m4:696: AS_IF is expanded from...60./lib/autoconf/general.m4:2305: AC_CACHE_VAL is expanded from...61./lib/autoconf/general.m4:2326: AC_CACHE_CHECK is expanded from...62m4/iconv.m4:20: AM_ICONV_LINK is expanded from...63m4/gettext.m4:57: AM_GNU_GETTEXT is expanded from...64configure.ac:4: the top level65configure.ac:405: warning: AC_ARG_PROGRAM was called before AC_CANONICAL_TARGET66./lib/autoconf/general.m4:2113: AC_CANONICAL_TARGET is expanded from...67configure.ac:405: the top level68configure.ac:452: warning: The macro 'AC_TRY_LINK' is obsolete.69configure.ac:452: You should run autoupdate.70./lib/autoconf/general.m4:2976: AC_TRY_LINK is expanded from...71configure.ac:452: the top level72autoreconf: running: /nix/store/khvvqawiqhcz4i4frnxn7wjxchps7wj5-autoconf-2.73/bin/autoheader --force73autoreconf: running: automake --add-missing --copy --force-missing74configure.ac:4: installing './compile'75configure.ac:2: installing './missing'76src/Makefile.am: installing './depcomp'77autoreconf: configure.ac: not running make: --make not given78autoreconf: Leaving directory '.'
updateAutotoolsGnuConfigScriptsPhase
79Updating Autotools / GNU config script to a newer upstream version: ./config.sub80Updating Autotools / GNU config script to a newer upstream version: ./config.guess
configurePhase
81patching script interpreter paths in ./configure82./configure: interpreter directive changed from "#! /bin/sh" to "/nix/store/svx59425zxp552p2b8gm11qj5r09b56i-bash-5.3p15/bin/sh"83configure flags: --disable-static --disable-dependency-tracking --prefix=/nix/store/rv10ai8ss3h0n9qisg7jg353dhyb9r2s-partclone-0.3.38 --enable-xfs --enable-extfs --enable-hfsp --enable-fat --enable-exfat --enable-ntfs --enable-btrfs --enable-minix --enable-f2fs --enable-nilfs284checking for a BSD-compatible install... /nix/store/xjl7p8dvyk2j53kqf7f43kdj4ypbxz7g-coreutils-9.11/bin/install -c85checking whether sleep supports fractional seconds... yes86checking filesystem timestamp resolution... 0.0187checking whether build environment is sane... yes88checking for a race-free mkdir -p... /nix/store/xjl7p8dvyk2j53kqf7f43kdj4ypbxz7g-coreutils-9.11/bin/mkdir -p89checking for gawk... gawk90checking whether make sets $(MAKE)... yes91checking whether make supports nested variables... yes92checking xargs -n works... yes93checking whether UID '1000' is supported by ustar format... yes94checking whether GID '100' is supported by ustar format... yes95checking how to create a ustar tar archive... gnutar96checking whether NLS is requested... yes97checking for msgfmt... /nix/store/sal5l525psrrii8w1c9dhznb8sdajl30-gettext-1.0/bin/msgfmt98checking for gmsgfmt... /nix/store/sal5l525psrrii8w1c9dhznb8sdajl30-gettext-1.0/bin/msgfmt99checking for xgettext... /nix/store/sal5l525psrrii8w1c9dhznb8sdajl30-gettext-1.0/bin/xgettext100checking for msgmerge... /nix/store/sal5l525psrrii8w1c9dhznb8sdajl30-gettext-1.0/bin/msgmerge101checking whether make supports the include directive... yes (GNU style)102checking for gcc... gcc103checking whether the C compiler works... yes104checking for C compiler default output file name... a.out105checking for suffix of executables... 106checking whether we are cross compiling... no107checking for suffix of object files... o108checking whether the compiler supports GNU C... yes109checking whether gcc accepts -g... yes110checking for gcc option to enable C23 features... none needed111checking whether gcc understands -c and -o together... yes112checking dependency style of gcc... none113checking build system type... x86_64-pc-linux-gnu114checking host system type... x86_64-pc-linux-gnu115checking for ld used by GCC... ld116checking if the linker (ld) is GNU ld... yes117checking for shared library run path origin... done118checking for CFPreferencesCopyAppValue... no119checking for CFLocaleCopyCurrent... no120checking for GNU gettext in libc... yes121checking whether to use NLS... yes122checking where the gettext function comes from... libc123checking for gcc... (cached) gcc124checking whether the compiler supports GNU C... (cached) yes125checking whether gcc accepts -g... (cached) yes126checking for gcc option to enable C23 features... (cached) none needed127checking whether gcc understands -c and -o together... (cached) yes128checking dependency style of gcc... (cached) none129checking dependency style of gcc... none130checking for rm... /nix/store/xjl7p8dvyk2j53kqf7f43kdj4ypbxz7g-coreutils-9.11/bin/rm131checking whether ln -s works... yes132checking for gcc option to support large files... none needed133checking pkg-config is at least version 0.9.0... yes134checking for uuid... yes135checking for pthread_create in -lpthread... yes136configure: checking for EXT2/3 Library and Header files ... ...137checking for stdio.h... yes138checking for stdlib.h... yes139checking for string.h... yes140checking for inttypes.h... yes141checking for stdint.h... yes142checking for strings.h... yes143checking for sys/stat.h... yes144checking for sys/types.h... yes145checking for unistd.h... yes146checking for ext2fs/ext2fs.h... yes147checking for ext2fs_initialize in -lext2fs... yes148checking version of libextfs... checking for ext2fs... yes149configure: checking for NILFS2 header files ... ...150checking for ctype.h... yes151checking for fcntl.h... yes152checking for grp.h... yes153checking for libintl.h... yes154checking for limits.h... yes155checking for linux/magic.h... yes156checking for linux/types.h... yes157checking for locale.h... yes158checking for mntent.h... yes159checking for mqueue.h... yes160checking for paths.h... yes161checking for pwd.h... yes162checking for semaphore.h... yes163checking for stdlib.h... (cached) yes164checking for string.h... (cached) yes165checking for strings.h... (cached) yes166checking for sys/ioctl.h... yes167checking for sys/mount.h... yes168checking for sys/time.h... yes169checking for syslog.h... yes170checking for sys/stat.h... (cached) yes171checking for time.h... yes172checking for unistd.h... (cached) yes173checking for nilfs.h... yes174checking for nilfs_open in -lnilfs... yes175configure: checking for NTFS-3g Library and Header files ... ...176checking for sys/time.h... (cached) yes177checking for sys/stat.h... (cached) yes178checking for time.h... (cached) yes179checking for ntfs-3g/misc.h... yes180checking for ntfs_mount in -lntfs-3g... yes181configure: checking for NTFS Library and Header files ... ...182checking for ntfs/version.h... no183configure: WARNING: *** NTFS(ntfsprogs) header not found184checking for ntfs_mount in -lntfs... no185configure: WARNING: *** ntfsprogs library (libntfs) not found186checking for libntfs-3g >= 2010... yes187checking for blkid/blkid.h... yes188checking target system type... x86_64-pc-linux-gnu189checking for EVP_MD_CTX_new in -lcrypto... yes190checking for EVP_MD_CTX_create in -lcrypto... no191checking for EVP_MD_CTX_reset in -lcrypto... yes192checking for gcc options to detect undeclared functions... none needed193checking for gcc options to ignore future-version functions... none needed194checking whether isnormal is declared... yes195checking for byteswap.h... yes196checking for initscr in -ltinfo... no197configure: WARNING: *** tinfo library (libtinfo) not found198checking that generated files are newer than configure... done199configure: creating ./config.status200config.status: creating Makefile201config.status: creating src/Makefile202config.status: creating po/Makefile.in203config.status: creating docs/Makefile204config.status: creating tests/Makefile205config.status: creating config.h206config.status: executing po-directories commands207config.status: creating po/POTFILES208config.status: creating po/Makefile209config.status: executing depfiles commands210211Support File System:212fuse.......... no, 213ext2/3/4...... yes, 1.47.4214reiserfs...... no, 215reiser4....... no, 216xfs........... yes, build-in217ntfs.......... yes, 2026.7.7218fat12/16/32... yes, build-in219exfat......... yes, build-in220hfs plus...... yes, build-in221apfs.......... no, 222ufs .......... no, 223vmfs ......... no, 224jfs .......... no, 225btrfs......... yes, unknown226minix......... yes, build-in227f2fs.......... yes, build-in 1.16228nilfs2.........yes, unknown, suggest 2.3.2
buildPhase
229build flags: -j48 SHELL=/nix/store/svx59425zxp552p2b8gm11qj5r09b56i-bash-5.3p15/bin/bash230make all-recursive231make[1]: Entering directory '/build/source'232Making all in po233make[2]: Entering directory '/build/source/po'234make[2]: Nothing to be done for 'all'.235make[2]: Leaving directory '/build/source/po'236Making all in src237make[2]: Entering directory '/build/source/src'238gcc -DHAVE_CONFIG_H -I. -I.. -DLOCALEDIR=\"/nix/store/rv10ai8ss3h0n9qisg7jg353dhyb9r2s-partclone-0.3.38/share/locale\" -D_FILE_OFFSET_BITS=64 -D_FILE_OFFSET_BITS=64 -g -O2 -Wall -c -o info.o info.c239gcc -DHAVE_CONFIG_H -I. -I.. -DLOCALEDIR=\"/nix/store/rv10ai8ss3h0n9qisg7jg353dhyb9r2s-partclone-0.3.38/share/locale\" -D_FILE_OFFSET_BITS=64 -D_FILE_OFFSET_BITS=64 -g -O2 -Wall -c -o partclone.o partclone.c240gcc -DHAVE_CONFIG_H -I. -I.. -DLOCALEDIR=\"/nix/store/rv10ai8ss3h0n9qisg7jg353dhyb9r2s-partclone-0.3.38/share/locale\" -D_FILE_OFFSET_BITS=64 -D_FILE_OFFSET_BITS=64 -g -O2 -Wall -c -o checksum.o checksum.c241gcc -DHAVE_CONFIG_H -I. -I.. -DLOCALEDIR=\"/nix/store/rv10ai8ss3h0n9qisg7jg353dhyb9r2s-partclone-0.3.38/share/locale\" -D_FILE_OFFSET_BITS=64 -DDD -g -O2 -Wall -c -o partclone_dd-main.o `test -f 'main.c' || echo './'`main.c242gcc -DHAVE_CONFIG_H -I. -I.. -DLOCALEDIR=\"/nix/store/rv10ai8ss3h0n9qisg7jg353dhyb9r2s-partclone-0.3.38/share/locale\" -D_FILE_OFFSET_BITS=64 -DDD -g -O2 -Wall -c -o partclone_dd-partclone.o `test -f 'partclone.c' || echo './'`partclone.c243gcc -DHAVE_CONFIG_H -I. -I.. -DLOCALEDIR=\"/nix/store/rv10ai8ss3h0n9qisg7jg353dhyb9r2s-partclone-0.3.38/share/locale\" -D_FILE_OFFSET_BITS=64 -DDD -g -O2 -Wall -c -o partclone_dd-progress.o `test -f 'progress.c' || echo './'`progress.c244gcc -DHAVE_CONFIG_H -I. -I.. -DLOCALEDIR=\"/nix/store/rv10ai8ss3h0n9qisg7jg353dhyb9r2s-partclone-0.3.38/share/locale\" -D_FILE_OFFSET_BITS=64 -DDD -g -O2 -Wall -c -o partclone_dd-checksum.o `test -f 'checksum.c' || echo './'`checksum.c245gcc -DHAVE_CONFIG_H -I. -I.. -DLOCALEDIR=\"/nix/store/rv10ai8ss3h0n9qisg7jg353dhyb9r2s-partclone-0.3.38/share/locale\" -D_FILE_OFFSET_BITS=64 -DDD -g -O2 -Wall -c -o partclone_dd-torrent_helper.o `test -f 'torrent_helper.c' || echo './'`torrent_helper.c246gcc -DHAVE_CONFIG_H -I. -I.. -DLOCALEDIR=\"/nix/store/rv10ai8ss3h0n9qisg7jg353dhyb9r2s-partclone-0.3.38/share/locale\" -D_FILE_OFFSET_BITS=64 -DDD -g -O2 -Wall -c -o partclone_dd-ddclone.o `test -f 'ddclone.c' || echo './'`ddclone.c247gcc -DHAVE_CONFIG_H -I. -I.. -DLOCALEDIR=\"/nix/store/rv10ai8ss3h0n9qisg7jg353dhyb9r2s-partclone-0.3.38/share/locale\" -D_FILE_OFFSET_BITS=64 -DRESTORE -DDD -g -O2 -Wall -c -o partclone_restore-main.o `test -f 'main.c' || echo './'`main.c248gcc -DHAVE_CONFIG_H -I. -I.. -DLOCALEDIR=\"/nix/store/rv10ai8ss3h0n9qisg7jg353dhyb9r2s-partclone-0.3.38/share/locale\" -D_FILE_OFFSET_BITS=64 -DRESTORE -DDD -g -O2 -Wall -c -o partclone_restore-partclone.o `test -f 'partclone.c' || echo './'`partclone.c249gcc -DHAVE_CONFIG_H -I. -I.. -DLOCALEDIR=\"/nix/store/rv10ai8ss3h0n9qisg7jg353dhyb9r2s-partclone-0.3.38/share/locale\" -D_FILE_OFFSET_BITS=64 -DRESTORE -DDD -g -O2 -Wall -c -o partclone_restore-progress.o `test -f 'progress.c' || echo './'`progress.c250gcc -DHAVE_CONFIG_H -I. -I.. -DLOCALEDIR=\"/nix/store/rv10ai8ss3h0n9qisg7jg353dhyb9r2s-partclone-0.3.38/share/locale\" -D_FILE_OFFSET_BITS=64 -DRESTORE -DDD -g -O2 -Wall -c -o partclone_restore-checksum.o `test -f 'checksum.c' || echo './'`checksum.c251gcc -DHAVE_CONFIG_H -I. -I.. -DLOCALEDIR=\"/nix/store/rv10ai8ss3h0n9qisg7jg353dhyb9r2s-partclone-0.3.38/share/locale\" -D_FILE_OFFSET_BITS=64 -DRESTORE -DDD -g -O2 -Wall -c -o partclone_restore-torrent_helper.o `test -f 'torrent_helper.c' || echo './'`torrent_helper.c252gcc -DHAVE_CONFIG_H -I. -I.. -DLOCALEDIR=\"/nix/store/rv10ai8ss3h0n9qisg7jg353dhyb9r2s-partclone-0.3.38/share/locale\" -D_FILE_OFFSET_BITS=64 -DRESTORE -DDD -g -O2 -Wall -c -o partclone_restore-ddclone.o `test -f 'ddclone.c' || echo './'`ddclone.c253gcc -DHAVE_CONFIG_H -I. -I.. -DLOCALEDIR=\"/nix/store/rv10ai8ss3h0n9qisg7jg353dhyb9r2s-partclone-0.3.38/share/locale\" -D_FILE_OFFSET_BITS=64 -DCHKIMG -DDD -g -O2 -Wall -c -o partclone_chkimg-main.o `test -f 'main.c' || echo './'`main.c254gcc -DHAVE_CONFIG_H -I. -I.. -DLOCALEDIR=\"/nix/store/rv10ai8ss3h0n9qisg7jg353dhyb9r2s-partclone-0.3.38/share/locale\" -D_FILE_OFFSET_BITS=64 -DCHKIMG -DDD -g -O2 -Wall -c -o partclone_chkimg-partclone.o `test -f 'partclone.c' || echo './'`partclone.c255gcc -DHAVE_CONFIG_H -I. -I.. -DLOCALEDIR=\"/nix/store/rv10ai8ss3h0n9qisg7jg353dhyb9r2s-partclone-0.3.38/share/locale\" -D_FILE_OFFSET_BITS=64 -DCHKIMG -DDD -g -O2 -Wall -c -o partclone_chkimg-progress.o `test -f 'progress.c' || echo './'`progress.c256gcc -DHAVE_CONFIG_H -I. -I.. -DLOCALEDIR=\"/nix/store/rv10ai8ss3h0n9qisg7jg353dhyb9r2s-partclone-0.3.38/share/locale\" -D_FILE_OFFSET_BITS=64 -DCHKIMG -DDD -g -O2 -Wall -c -o partclone_chkimg-checksum.o `test -f 'checksum.c' || echo './'`checksum.c257gcc -DHAVE_CONFIG_H -I. -I.. -DLOCALEDIR=\"/nix/store/rv10ai8ss3h0n9qisg7jg353dhyb9r2s-partclone-0.3.38/share/locale\" -D_FILE_OFFSET_BITS=64 -DCHKIMG -DDD -g -O2 -Wall -c -o partclone_chkimg-torrent_helper.o `test -f 'torrent_helper.c' || echo './'`torrent_helper.c258gcc -DHAVE_CONFIG_H -I. -I.. -DLOCALEDIR=\"/nix/store/rv10ai8ss3h0n9qisg7jg353dhyb9r2s-partclone-0.3.38/share/locale\" -D_FILE_OFFSET_BITS=64 -DCHKIMG -DDD -g -O2 -Wall -c -o partclone_chkimg-ddclone.o `test -f 'ddclone.c' || echo './'`ddclone.c259gcc -DHAVE_CONFIG_H -I. -I.. -DLOCALEDIR=\"/nix/store/rv10ai8ss3h0n9qisg7jg353dhyb9r2s-partclone-0.3.38/share/locale\" -D_FILE_OFFSET_BITS=64 -DIMG -g -O2 -Wall -c -o partclone_imager-main.o `test -f 'main.c' || echo './'`main.c260gcc -DHAVE_CONFIG_H -I. -I.. -DLOCALEDIR=\"/nix/store/rv10ai8ss3h0n9qisg7jg353dhyb9r2s-partclone-0.3.38/share/locale\" -D_FILE_OFFSET_BITS=64 -DIMG -g -O2 -Wall -c -o partclone_imager-partclone.o `test -f 'partclone.c' || echo './'`partclone.c261gcc -DHAVE_CONFIG_H -I. -I.. -DLOCALEDIR=\"/nix/store/rv10ai8ss3h0n9qisg7jg353dhyb9r2s-partclone-0.3.38/share/locale\" -D_FILE_OFFSET_BITS=64 -DIMG -g -O2 -Wall -c -o partclone_imager-progress.o `test -f 'progress.c' || echo './'`progress.c262gcc -DHAVE_CONFIG_H -I. -I.. -DLOCALEDIR=\"/nix/store/rv10ai8ss3h0n9qisg7jg353dhyb9r2s-partclone-0.3.38/share/locale\" -D_FILE_OFFSET_BITS=64 -DIMG -g -O2 -Wall -c -o partclone_imager-checksum.o `test -f 'checksum.c' || echo './'`checksum.c263gcc -DHAVE_CONFIG_H -I. -I.. -DLOCALEDIR=\"/nix/store/rv10ai8ss3h0n9qisg7jg353dhyb9r2s-partclone-0.3.38/share/locale\" -D_FILE_OFFSET_BITS=64 -DIMG -g -O2 -Wall -c -o partclone_imager-torrent_helper.o `test -f 'torrent_helper.c' || echo './'`torrent_helper.c264gcc -DHAVE_CONFIG_H -I. -I.. -DLOCALEDIR=\"/nix/store/rv10ai8ss3h0n9qisg7jg353dhyb9r2s-partclone-0.3.38/share/locale\" -D_FILE_OFFSET_BITS=64 -DIMG -g -O2 -Wall -c -o partclone_imager-ddclone.o `test -f 'ddclone.c' || echo './'`ddclone.c265gcc -DHAVE_CONFIG_H -I. -I.. -DLOCALEDIR=\"/nix/store/rv10ai8ss3h0n9qisg7jg353dhyb9r2s-partclone-0.3.38/share/locale\" -D_FILE_OFFSET_BITS=64 -DEXTFS -g -O2 -Wall -c -o partclone_extfs-main.o `test -f 'main.c' || echo './'`main.c266gcc -DHAVE_CONFIG_H -I. -I.. -DLOCALEDIR=\"/nix/store/rv10ai8ss3h0n9qisg7jg353dhyb9r2s-partclone-0.3.38/share/locale\" -D_FILE_OFFSET_BITS=64 -DEXTFS -g -O2 -Wall -c -o partclone_extfs-partclone.o `test -f 'partclone.c' || echo './'`partclone.c267gcc -DHAVE_CONFIG_H -I. -I.. -DLOCALEDIR=\"/nix/store/rv10ai8ss3h0n9qisg7jg353dhyb9r2s-partclone-0.3.38/share/locale\" -D_FILE_OFFSET_BITS=64 -DEXTFS -g -O2 -Wall -c -o partclone_extfs-progress.o `test -f 'progress.c' || echo './'`progress.c268gcc -DHAVE_CONFIG_H -I. -I.. -DLOCALEDIR=\"/nix/store/rv10ai8ss3h0n9qisg7jg353dhyb9r2s-partclone-0.3.38/share/locale\" -D_FILE_OFFSET_BITS=64 -DEXTFS -g -O2 -Wall -c -o partclone_extfs-checksum.o `test -f 'checksum.c' || echo './'`checksum.c269gcc -DHAVE_CONFIG_H -I. -I.. -DLOCALEDIR=\"/nix/store/rv10ai8ss3h0n9qisg7jg353dhyb9r2s-partclone-0.3.38/share/locale\" -D_FILE_OFFSET_BITS=64 -DEXTFS -g -O2 -Wall -c -o partclone_extfs-torrent_helper.o `test -f 'torrent_helper.c' || echo './'`torrent_helper.c270gcc -DHAVE_CONFIG_H -I. -I.. -DLOCALEDIR=\"/nix/store/rv10ai8ss3h0n9qisg7jg353dhyb9r2s-partclone-0.3.38/share/locale\" -D_FILE_OFFSET_BITS=64 -DEXTFS -g -O2 -Wall -c -o partclone_extfs-extfsclone.o `test -f 'extfsclone.c' || echo './'`extfsclone.c271gcc -DHAVE_CONFIG_H -I. -I.. -DLOCALEDIR=\"/nix/store/rv10ai8ss3h0n9qisg7jg353dhyb9r2s-partclone-0.3.38/share/locale\" -D_FILE_OFFSET_BITS=64 -DHFSPLUS -g -O2 -Wall -c -o partclone_hfsp-main.o `test -f 'main.c' || echo './'`main.c272gcc -DHAVE_CONFIG_H -I. -I.. -DLOCALEDIR=\"/nix/store/rv10ai8ss3h0n9qisg7jg353dhyb9r2s-partclone-0.3.38/share/locale\" -D_FILE_OFFSET_BITS=64 -DHFSPLUS -g -O2 -Wall -c -o partclone_hfsp-partclone.o `test -f 'partclone.c' || echo './'`partclone.c273gcc -DHAVE_CONFIG_H -I. -I.. -DLOCALEDIR=\"/nix/store/rv10ai8ss3h0n9qisg7jg353dhyb9r2s-partclone-0.3.38/share/locale\" -D_FILE_OFFSET_BITS=64 -DHFSPLUS -g -O2 -Wall -c -o partclone_hfsp-progress.o `test -f 'progress.c' || echo './'`progress.c274gcc -DHAVE_CONFIG_H -I. -I.. -DLOCALEDIR=\"/nix/store/rv10ai8ss3h0n9qisg7jg353dhyb9r2s-partclone-0.3.38/share/locale\" -D_FILE_OFFSET_BITS=64 -DHFSPLUS -g -O2 -Wall -c -o partclone_hfsp-checksum.o `test -f 'checksum.c' || echo './'`checksum.c275gcc -DHAVE_CONFIG_H -I. -I.. -DLOCALEDIR=\"/nix/store/rv10ai8ss3h0n9qisg7jg353dhyb9r2s-partclone-0.3.38/share/locale\" -D_FILE_OFFSET_BITS=64 -DHFSPLUS -g -O2 -Wall -c -o partclone_hfsp-torrent_helper.o `test -f 'torrent_helper.c' || echo './'`torrent_helper.c276gcc -DHAVE_CONFIG_H -I. -I.. -DLOCALEDIR=\"/nix/store/rv10ai8ss3h0n9qisg7jg353dhyb9r2s-partclone-0.3.38/share/locale\" -D_FILE_OFFSET_BITS=64 -DHFSPLUS -g -O2 -Wall -c -o partclone_hfsp-hfsplusclone.o `test -f 'hfsplusclone.c' || echo './'`hfsplusclone.c277gcc -DHAVE_CONFIG_H -I. -I.. -DLOCALEDIR=\"/nix/store/rv10ai8ss3h0n9qisg7jg353dhyb9r2s-partclone-0.3.38/share/locale\" -D_FILE_OFFSET_BITS=64 -I./xfs/include -I./xfs/libxfs/ -I./xfs/include/xfs/ -DXFS -D_GNU_SOURCE -DNDEBUG -I/nix/store/liqj3zzlkn4qg038cadq99yww9vdqj70-util-linux-minimal-2.42.3-dev/include/uuid -g -O2 -Wall -c -o partclone_xfs-main.o `test -f 'main.c' || echo './'`main.c278gcc -DHAVE_CONFIG_H -I. -I.. -DLOCALEDIR=\"/nix/store/rv10ai8ss3h0n9qisg7jg353dhyb9r2s-partclone-0.3.38/share/locale\" -D_FILE_OFFSET_BITS=64 -I./xfs/include -I./xfs/libxfs/ -I./xfs/include/xfs/ -DXFS -D_GNU_SOURCE -DNDEBUG -I/nix/store/liqj3zzlkn4qg038cadq99yww9vdqj70-util-linux-minimal-2.42.3-dev/include/uuid -g -O2 -Wall -c -o partclone_xfs-partclone.o `test -f 'partclone.c' || echo './'`partclone.c279gcc -DHAVE_CONFIG_H -I. -I.. -DLOCALEDIR=\"/nix/store/rv10ai8ss3h0n9qisg7jg353dhyb9r2s-partclone-0.3.38/share/locale\" -D_FILE_OFFSET_BITS=64 -I./xfs/include -I./xfs/libxfs/ -I./xfs/include/xfs/ -DXFS -D_GNU_SOURCE -DNDEBUG -I/nix/store/liqj3zzlkn4qg038cadq99yww9vdqj70-util-linux-minimal-2.42.3-dev/include/uuid -g -O2 -Wall -c -o partclone_xfs-progress.o `test -f 'progress.c' || echo './'`progress.c280gcc -DHAVE_CONFIG_H -I. -I.. -DLOCALEDIR=\"/nix/store/rv10ai8ss3h0n9qisg7jg353dhyb9r2s-partclone-0.3.38/share/locale\" -D_FILE_OFFSET_BITS=64 -I./xfs/include -I./xfs/libxfs/ -I./xfs/include/xfs/ -DXFS -D_GNU_SOURCE -DNDEBUG -I/nix/store/liqj3zzlkn4qg038cadq99yww9vdqj70-util-linux-minimal-2.42.3-dev/include/uuid -g -O2 -Wall -c -o partclone_xfs-checksum.o `test -f 'checksum.c' || echo './'`checksum.c281gcc -DHAVE_CONFIG_H -I. -I.. -DLOCALEDIR=\"/nix/store/rv10ai8ss3h0n9qisg7jg353dhyb9r2s-partclone-0.3.38/share/locale\" -D_FILE_OFFSET_BITS=64 -I./xfs/include -I./xfs/libxfs/ -I./xfs/include/xfs/ -DXFS -D_GNU_SOURCE -DNDEBUG -I/nix/store/liqj3zzlkn4qg038cadq99yww9vdqj70-util-linux-minimal-2.42.3-dev/include/uuid -g -O2 -Wall -c -o partclone_xfs-torrent_helper.o `test -f 'torrent_helper.c' || echo './'`torrent_helper.c282gcc -DHAVE_CONFIG_H -I. -I.. -DLOCALEDIR=\"/nix/store/rv10ai8ss3h0n9qisg7jg353dhyb9r2s-partclone-0.3.38/share/locale\" -D_FILE_OFFSET_BITS=64 -I./xfs/include -I./xfs/libxfs/ -I./xfs/include/xfs/ -DXFS -D_GNU_SOURCE -DNDEBUG -I/nix/store/liqj3zzlkn4qg038cadq99yww9vdqj70-util-linux-minimal-2.42.3-dev/include/uuid -g -O2 -Wall -c -o partclone_xfs-xfsclone.o `test -f 'xfsclone.c' || echo './'`xfsclone.c283gcc -DHAVE_CONFIG_H -I. -I.. -DLOCALEDIR=\"/nix/store/rv10ai8ss3h0n9qisg7jg353dhyb9r2s-partclone-0.3.38/share/locale\" -D_FILE_OFFSET_BITS=64 -DEXFAT -D_GNU_SOURCE -std=c99 -g -O2 -Wall -c -o partclone_exfat-main.o `test -f 'main.c' || echo './'`main.c284gcc -DHAVE_CONFIG_H -I. -I.. -DLOCALEDIR=\"/nix/store/rv10ai8ss3h0n9qisg7jg353dhyb9r2s-partclone-0.3.38/share/locale\" -D_FILE_OFFSET_BITS=64 -DEXFAT -D_GNU_SOURCE -std=c99 -g -O2 -Wall -c -o partclone_exfat-partclone.o `test -f 'partclone.c' || echo './'`partclone.c285gcc -DHAVE_CONFIG_H -I. -I.. -DLOCALEDIR=\"/nix/store/rv10ai8ss3h0n9qisg7jg353dhyb9r2s-partclone-0.3.38/share/locale\" -D_FILE_OFFSET_BITS=64 -DEXFAT -D_GNU_SOURCE -std=c99 -g -O2 -Wall -c -o partclone_exfat-progress.o `test -f 'progress.c' || echo './'`progress.c286gcc -DHAVE_CONFIG_H -I. -I.. -DLOCALEDIR=\"/nix/store/rv10ai8ss3h0n9qisg7jg353dhyb9r2s-partclone-0.3.38/share/locale\" -D_FILE_OFFSET_BITS=64 -DEXFAT -D_GNU_SOURCE -std=c99 -g -O2 -Wall -c -o partclone_exfat-checksum.o `test -f 'checksum.c' || echo './'`checksum.c287gcc -DHAVE_CONFIG_H -I. -I.. -DLOCALEDIR=\"/nix/store/rv10ai8ss3h0n9qisg7jg353dhyb9r2s-partclone-0.3.38/share/locale\" -D_FILE_OFFSET_BITS=64 -DEXFAT -D_GNU_SOURCE -std=c99 -g -O2 -Wall -c -o partclone_exfat-torrent_helper.o `test -f 'torrent_helper.c' || echo './'`torrent_helper.c288main.c: In function 'main':289main.c:685:17: warning: ignoring return value of 'posix_memalign' declared with attribute 'warn_unused_result' [-Wunused-result]290 685 | posix_memalign((void**)&write_buffer, BSIZE, buffer_capacity * block_size);291 | ^~~~~~~~~~~~~~~~~~~~~~~~~~~~~~~~~~~~~~~~~~~~~~~~~~~~~~~~~~~~~~~~~~~~~~~~~~292gcc -DHAVE_CONFIG_H -I. -I.. -DLOCALEDIR=\"/nix/store/rv10ai8ss3h0n9qisg7jg353dhyb9r2s-partclone-0.3.38/share/locale\" -D_FILE_OFFSET_BITS=64 -DEXFAT -D_GNU_SOURCE -std=c99 -g -O2 -Wall -c -o partclone_exfat-exfatclone.o `test -f 'exfatclone.c' || echo './'`exfatclone.c293gcc -DHAVE_CONFIG_H -I. -I.. -DLOCALEDIR=\"/nix/store/rv10ai8ss3h0n9qisg7jg353dhyb9r2s-partclone-0.3.38/share/locale\" -D_FILE_OFFSET_BITS=64 -DF2FS -DHAVE_MNTENT_H=1 -DHAVE_SYS_MOUNT_H=1 -DHAVE_SYS_SYSMACROS_H=1 -DHAVE_SYS_UTSNAME_H=1 -DHAVE_SCSI_SG_H=1 -DHAVE_SYS_IOCTL_H=1 -DHAVE_LINUX_HDREG_H -DHAVE_LINUX_LIMITS_H=1 -DHAVE_LINUX_TYPES_H=1 -DHAVE_LSEEK64=1 -DHAVE_SETMNTENT=1 -I./f2fs/ -g -O2 -Wall -c -o partclone_f2fs-main.o `test -f 'main.c' || echo './'`main.c294gcc -DHAVE_CONFIG_H -I. -I.. -DLOCALEDIR=\"/nix/store/rv10ai8ss3h0n9qisg7jg353dhyb9r2s-partclone-0.3.38/share/locale\" -D_FILE_OFFSET_BITS=64 -DF2FS -DHAVE_MNTENT_H=1 -DHAVE_SYS_MOUNT_H=1 -DHAVE_SYS_SYSMACROS_H=1 -DHAVE_SYS_UTSNAME_H=1 -DHAVE_SCSI_SG_H=1 -DHAVE_SYS_IOCTL_H=1 -DHAVE_LINUX_HDREG_H -DHAVE_LINUX_LIMITS_H=1 -DHAVE_LINUX_TYPES_H=1 -DHAVE_LSEEK64=1 -DHAVE_SETMNTENT=1 -I./f2fs/ -g -O2 -Wall -c -o partclone_f2fs-partclone.o `test -f 'partclone.c' || echo './'`partclone.c295gcc -DHAVE_CONFIG_H -I. -I.. -DLOCALEDIR=\"/nix/store/rv10ai8ss3h0n9qisg7jg353dhyb9r2s-partclone-0.3.38/share/locale\" -D_FILE_OFFSET_BITS=64 -DF2FS -DHAVE_MNTENT_H=1 -DHAVE_SYS_MOUNT_H=1 -DHAVE_SYS_SYSMACROS_H=1 -DHAVE_SYS_UTSNAME_H=1 -DHAVE_SCSI_SG_H=1 -DHAVE_SYS_IOCTL_H=1 -DHAVE_LINUX_HDREG_H -DHAVE_LINUX_LIMITS_H=1 -DHAVE_LINUX_TYPES_H=1 -DHAVE_LSEEK64=1 -DHAVE_SETMNTENT=1 -I./f2fs/ -g -O2 -Wall -c -o partclone_f2fs-progress.o `test -f 'progress.c' || echo './'`progress.c296gcc -DHAVE_CONFIG_H -I. -I.. -DLOCALEDIR=\"/nix/store/rv10ai8ss3h0n9qisg7jg353dhyb9r2s-partclone-0.3.38/share/locale\" -D_FILE_OFFSET_BITS=64 -DF2FS -DHAVE_MNTENT_H=1 -DHAVE_SYS_MOUNT_H=1 -DHAVE_SYS_SYSMACROS_H=1 -DHAVE_SYS_UTSNAME_H=1 -DHAVE_SCSI_SG_H=1 -DHAVE_SYS_IOCTL_H=1 -DHAVE_LINUX_HDREG_H -DHAVE_LINUX_LIMITS_H=1 -DHAVE_LINUX_TYPES_H=1 -DHAVE_LSEEK64=1 -DHAVE_SETMNTENT=1 -I./f2fs/ -g -O2 -Wall -c -o partclone_f2fs-checksum.o `test -f 'checksum.c' || echo './'`checksum.c297gcc -DHAVE_CONFIG_H -I. -I.. -DLOCALEDIR=\"/nix/store/rv10ai8ss3h0n9qisg7jg353dhyb9r2s-partclone-0.3.38/share/locale\" -D_FILE_OFFSET_BITS=64 -DF2FS -DHAVE_MNTENT_H=1 -DHAVE_SYS_MOUNT_H=1 -DHAVE_SYS_SYSMACROS_H=1 -DHAVE_SYS_UTSNAME_H=1 -DHAVE_SCSI_SG_H=1 -DHAVE_SYS_IOCTL_H=1 -DHAVE_LINUX_HDREG_H -DHAVE_LINUX_LIMITS_H=1 -DHAVE_LINUX_TYPES_H=1 -DHAVE_LSEEK64=1 -DHAVE_SETMNTENT=1 -I./f2fs/ -g -O2 -Wall -c -o partclone_f2fs-torrent_helper.o `test -f 'torrent_helper.c' || echo './'`torrent_helper.c298xfsclone.c: In function 'scan_freelist':299gcc -DHAVE_CONFIG_H -I. -I.. -DLOCALEDIR=\"/nix/store/rv10ai8ss3h0n9qisg7jg353dhyb9r2s-partclone-0.3.38/share/locale\" -D_FILE_OFFSET_BITS=64 -DF2FS -DHAVE_MNTENT_H=1 -DHAVE_SYS_MOUNT_H=1 -DHAVE_SYS_SYSMACROS_H=1 -DHAVE_SYS_UTSNAME_H=1 -DHAVE_SCSI_SG_H=1 -DHAVE_SYS_IOCTL_H=1 -DHAVE_LINUX_HDREG_H -DHAVE_LINUX_LIMITS_H=1 -DHAVE_LINUX_TYPES_H=1 -DHAVE_LSEEK64=1 -DHAVE_SETMNTENT=1 -I./f2fs/ -g -O2 -Wall -c -o partclone_f2fs-f2fsclone.o `test -f 'f2fsclone.c' || echo './'`f2fsclone.c300xfsclone.c:202:55: warning: taking address of packed member of 'struct xfs_agfl' may result in an unaligned pointer value [-Waddress-of-packed-member]301 202 | agfl_bno = xfs_sb_version_hascrc(&mp->m_sb) ? &agfl->agfl_bno[0]302 | ^~~~~~~~~~~~~~~~~~303main.c: In function 'main':304main.c:685:17: warning: ignoring return value of 'posix_memalign' declared with attribute 'warn_unused_result' [-Wunused-result]305 685 | posix_memalign((void**)&write_buffer, BSIZE, buffer_capacity * block_size);306 | ^~~~~~~~~~~~~~~~~~~~~~~~~~~~~~~~~~~~~~~~~~~~~~~~~~~~~~~~~~~~~~~~~~~~~~~~~~307hfsplusclone.c: In function 'fs_open':308hfsplusclone.c:135:5: warning: 'HFS_Signature' is used uninitialized [-Wuninitialized]309 135 | log_mesg(2, 0, 0, fs_opt.debug, "%s: HFS_Plus signature original endian %x \n", __FILE__, HFS_Signature);310 | ^~~~~~~~~~~~~~~~~~~~~~~~~~~~~~~~~~~~~~~~~~~~~~~~~~~~~~~~~~~~~~~~~~~~~~~~~~~~~~~~~~~~~~~~~~~~~~~~~~~~~~~~311hfsplusclone.c:120:11: note: 'HFS_Signature' was declared here312 120 | short HFS_Signature;313 | ^~~~~~~~~~~~~314main.c: In function 'main':315main.c:685:17: warning: ignoring return value of 'posix_memalign' declared with attribute 'warn_unused_result' [-Wunused-result]316 685 | posix_memalign((void**)&write_buffer, BSIZE, buffer_capacity * block_size);317 | ^~~~~~~~~~~~~~~~~~~~~~~~~~~~~~~~~~~~~~~~~~~~~~~~~~~~~~~~~~~~~~~~~~~~~~~~~~318main.c: In function 'main':319main.c:685:17: warning: ignoring return value of 'posix_memalign' declared with attribute 'warn_unused_result' [-Wunused-result]320 685 | posix_memalign((void**)&write_buffer, BSIZE, buffer_capacity * block_size);321 | ^~~~~~~~~~~~~~~~~~~~~~~~~~~~~~~~~~~~~~~~~~~~~~~~~~~~~~~~~~~~~~~~~~~~~~~~~~322main.c: In function 'main':323main.c:685:17: warning: ignoring return value of 'posix_memalign' declared with attribute 'warn_unused_result' [-Wunused-result]324 685 | posix_memalign((void**)&write_buffer, BSIZE, buffer_capacity * block_size);325 | ^~~~~~~~~~~~~~~~~~~~~~~~~~~~~~~~~~~~~~~~~~~~~~~~~~~~~~~~~~~~~~~~~~~~~~~~~~326gcc -DHAVE_CONFIG_H -I. -I.. -DLOCALEDIR=\"/nix/store/rv10ai8ss3h0n9qisg7jg353dhyb9r2s-partclone-0.3.38/share/locale\" -D_FILE_OFFSET_BITS=64 -DNILFS -g -O2 -Wall -c -o partclone_nilfs2-main.o `test -f 'main.c' || echo './'`main.c327main.c: In function 'main':328main.c:685:17: warning: ignoring return value of 'posix_memalign' declared with attribute 'warn_unused_result' [-Wunused-result]329 685 | posix_memalign((void**)&write_buffer, BSIZE, buffer_capacity * block_size);330 | ^~~~~~~~~~~~~~~~~~~~~~~~~~~~~~~~~~~~~~~~~~~~~~~~~~~~~~~~~~~~~~~~~~~~~~~~~~331partclone.c: In function 'load_image_desc':332partclone.c:982:60: warning: array subscript 'image_desc_v1[0]' is partly outside array bounds of 'image_desc_v2[1]' [-Warray-bounds=]333 982 | load_image_desc_v1(fs_info, img_opt, buf_v1->head, buf_v1->fs_info, opt);334 | ^~335partclone.c:956:23: note: object 'buf_v2' of size 110336 956 | image_desc_v2 buf_v2;337 | ^~~~~~338partclone.c:982:74: warning: array subscript 'image_desc_v1[0]' is partly outside array bounds of 'image_desc_v2[1]' [-Warray-bounds=]339 982 | load_image_desc_v1(fs_info, img_opt, buf_v1->head, buf_v1->fs_info, opt);340 | ^~341partclone.c:956:23: note: object 'buf_v2' of size 110342 956 | image_desc_v2 buf_v2;343 | ^~~~~~344gcc -DHAVE_CONFIG_H -I. -I.. -DLOCALEDIR=\"/nix/store/rv10ai8ss3h0n9qisg7jg353dhyb9r2s-partclone-0.3.38/share/locale\" -D_FILE_OFFSET_BITS=64 -DNILFS -g -O2 -Wall -c -o partclone_nilfs2-partclone.o `test -f 'partclone.c' || echo './'`partclone.c345gcc -DHAVE_CONFIG_H -I. -I.. -DLOCALEDIR=\"/nix/store/rv10ai8ss3h0n9qisg7jg353dhyb9r2s-partclone-0.3.38/share/locale\" -D_FILE_OFFSET_BITS=64 -DNILFS -g -O2 -Wall -c -o partclone_nilfs2-progress.o `test -f 'progress.c' || echo './'`progress.c346main.c: In function 'main':347main.c:685:17: warning: ignoring return value of 'posix_memalign' declared with attribute 'warn_unused_result' [-Wunused-result]348 685 | posix_memalign((void**)&write_buffer, BSIZE, buffer_capacity * block_size);349 | ^~~~~~~~~~~~~~~~~~~~~~~~~~~~~~~~~~~~~~~~~~~~~~~~~~~~~~~~~~~~~~~~~~~~~~~~~~350main.c: In function 'main':351main.c:685:17: warning: ignoring return value of 'posix_memalign' declared with attribute 'warn_unused_result' [-Wunused-result]352 685 | posix_memalign((void**)&write_buffer, BSIZE, buffer_capacity * block_size);353 | ^~~~~~~~~~~~~~~~~~~~~~~~~~~~~~~~~~~~~~~~~~~~~~~~~~~~~~~~~~~~~~~~~~~~~~~~~~354main.c: In function 'main':355main.c:685:17: warning: ignoring return value of 'posix_memalign' declared with attribute 'warn_unused_result' [-Wunused-result]356 685 | posix_memalign((void**)&write_buffer, BSIZE, buffer_capacity * block_size);357 | ^~~~~~~~~~~~~~~~~~~~~~~~~~~~~~~~~~~~~~~~~~~~~~~~~~~~~~~~~~~~~~~~~~~~~~~~~~358partclone.c: In function 'load_image_desc':359partclone.c:982:60: warning: array subscript 'image_desc_v1[0]' is partly outside array bounds of 'image_desc_v2[1]' [-Warray-bounds=]360 982 | load_image_desc_v1(fs_info, img_opt, buf_v1->head, buf_v1->fs_info, opt);361 | ^~362partclone.c:956:23: note: object 'buf_v2' of size 110363 956 | image_desc_v2 buf_v2;364 | ^~~~~~365partclone.c:982:74: warning: array subscript 'image_desc_v1[0]' is partly outside array bounds of 'image_desc_v2[1]' [-Warray-bounds=]366 982 | load_image_desc_v1(fs_info, img_opt, buf_v1->head, buf_v1->fs_info, opt);367 | ^~368partclone.c:956:23: note: object 'buf_v2' of size 110369 956 | image_desc_v2 buf_v2;370 | ^~~~~~371partclone.c: In function 'load_image_desc':372partclone.c: In function 'load_image_desc':373partclone.c:982:60: warning: array subscript 'image_desc_v1[0]' is partly outside array bounds of 'image_desc_v2[1]' [-Warray-bounds=]374 982 | load_image_desc_v1(fs_info, img_opt, buf_v1->head, buf_v1->fs_info, opt);375 | ^~376partclone.c:956:23: note: object 'buf_v2' of size 110377 956 | image_desc_v2 buf_v2;378 | ^~~~~~379partclone.c:982:74: warning: array subscript 'image_desc_v1[0]' is partly outside array bounds of 'image_desc_v2[1]' [-Warray-bounds=]380 982 | load_image_desc_v1(fs_info, img_opt, buf_v1->head, buf_v1->fs_info, opt);381 | ^~382partclone.c: In function 'load_image_desc':383partclone.c:982:60: warning: array subscript 'image_desc_v1[0]' is partly outside array bounds of 'image_desc_v2[1]' [-Warray-bounds=]384 982 | load_image_desc_v1(fs_info, img_opt, buf_v1->head, buf_v1->fs_info, opt);385 | ^~386partclone.c:956:23: note: object 'buf_v2' of size 110387 956 | image_desc_v2 buf_v2;388 | ^~~~~~389partclone.c:982:74: warning: array subscript 'image_desc_v1[0]' is partly outside array bounds of 'image_desc_v2[1]' [-Warray-bounds=]390 982 | load_image_desc_v1(fs_info, img_opt, buf_v1->head, buf_v1->fs_info, opt);391 | ^~392partclone.c:956:23: note: object 'buf_v2' of size 110393 956 | image_desc_v2 buf_v2;394 | ^~~~~~395partclone.c:956:23: note: object 'buf_v2' of size 110396 956 | image_desc_v2 buf_v2;397 | ^~~~~~398partclone.c: In function 'load_image_desc':399partclone.c:982:60: warning: array subscript 'image_desc_v1[0]' is partly outside array bounds of 'image_desc_v2[1]' [-Warray-bounds=]400 982 | load_image_desc_v1(fs_info, img_opt, buf_v1->head, buf_v1->fs_info, opt);401 | ^~402partclone.c:956:23: note: object 'buf_v2' of size 110403 956 | image_desc_v2 buf_v2;404 | ^~~~~~405partclone.c:982:74: warning: array subscript 'image_desc_v1[0]' is partly outside array bounds of 'image_desc_v2[1]' [-Warray-bounds=]406 982 | load_image_desc_v1(fs_info, img_opt, buf_v1->head, buf_v1->fs_info, opt);407 | ^~408partclone.c:956:23: note: object 'buf_v2' of size 110409 956 | image_desc_v2 buf_v2;410 | ^~~~~~411partclone.c: In function 'load_image_desc':412partclone.c:982:60: warning: array subscript 'image_desc_v1[0]' is partly outside array bounds of 'image_desc_v2[1]' [-Warray-bounds=]413 982 | load_image_desc_v1(fs_info, img_opt, buf_v1->head, buf_v1->fs_info, opt);414 | ^~415partclone.c:956:23: note: object 'buf_v2' of size 110416 956 | image_desc_v2 buf_v2;417 | ^~~~~~418partclone.c:982:74: warning: array subscript 'image_desc_v1[0]' is partly outside array bounds of 'image_desc_v2[1]' [-Warray-bounds=]419 982 | load_image_desc_v1(fs_info, img_opt, buf_v1->head, buf_v1->fs_info, opt);420 | ^~421partclone.c: In function 'load_image_desc':422partclone.c:982:60: warning: array subscript 'image_desc_v1[0]' is partly outside array bounds of 'image_desc_v2[1]' [-Warray-bounds=]423 982 | load_image_desc_v1(fs_info, img_opt, buf_v1->head, buf_v1->fs_info, opt);424 | ^~425partclone.c:956:23: note: object 'buf_v2' of size 110426 956 | image_desc_v2 buf_v2;427 | ^~~~~~428partclone.c:982:74: warning: array subscript 'image_desc_v1[0]' is partly outside array bounds of 'image_desc_v2[1]' [-Warray-bounds=]429 982 | load_image_desc_v1(fs_info, img_opt, buf_v1->head, buf_v1->fs_info, opt);430 | ^~431partclone.c:956:23: note: object 'buf_v2' of size 110432 956 | image_desc_v2 buf_v2;433 | ^~~~~~434partclone.c: In function 'load_image_desc':435partclone.c:982:60: warning: array subscript 'image_desc_v1[0]' is partly outside array bounds of 'image_desc_v2[1]' [-Warray-bounds=]436 982 | load_image_desc_v1(fs_info, img_opt, buf_v1->head, buf_v1->fs_info, opt);437 | ^~438partclone.c:956:23: note: object 'buf_v2' of size 110439 956 | image_desc_v2 buf_v2;440 | ^~~~~~441partclone.c:982:74: warning: array subscript 'image_desc_v1[0]' is partly outside array bounds of 'image_desc_v2[1]' [-Warray-bounds=]442 982 | load_image_desc_v1(fs_info, img_opt, buf_v1->head, buf_v1->fs_info, opt);443 | ^~444partclone.c:956:23: note: object 'buf_v2' of size 110445 956 | image_desc_v2 buf_v2;446 | ^~~~~~447partclone.c: In function 'load_image_desc':448partclone.c:982:60: warning: array subscript 'image_desc_v1[0]' is partly outside array bounds of 'image_desc_v2[1]' [-Warray-bounds=]449 982 | load_image_desc_v1(fs_info, img_opt, buf_v1->head, buf_v1->fs_info, opt);450 | ^~451partclone.c:956:23: note: object 'buf_v2' of size 110452 956 | image_desc_v2 buf_v2;453 | ^~~~~~454partclone.c:982:74: warning: array subscript 'image_desc_v1[0]' is partly outside array bounds of 'image_desc_v2[1]' [-Warray-bounds=]455 982 | load_image_desc_v1(fs_info, img_opt, buf_v1->head, buf_v1->fs_info, opt);456 | ^~457partclone.c:956:23: note: object 'buf_v2' of size 110458 956 | image_desc_v2 buf_v2;459 | ^~~~~~460gcc -DHAVE_CONFIG_H -I. -I.. -DLOCALEDIR=\"/nix/store/rv10ai8ss3h0n9qisg7jg353dhyb9r2s-partclone-0.3.38/share/locale\" -D_FILE_OFFSET_BITS=64 -DNILFS -g -O2 -Wall -c -o partclone_nilfs2-checksum.o `test -f 'checksum.c' || echo './'`checksum.c461partclone.c:982:60: warning: array subscript 'image_desc_v1[0]' is partly outside array bounds of 'image_desc_v2[1]' [-Warray-bounds=]462 982 | load_image_desc_v1(fs_info, img_opt, buf_v1->head, buf_v1->fs_info, opt);463 | ^~464partclone.c:956:23: note: object 'buf_v2' of size 110465 956 | image_desc_v2 buf_v2;466 | ^~~~~~467partclone.c:982:74: warning: array subscript 'image_desc_v1[0]' is partly outside array bounds of 'image_desc_v2[1]' [-Warray-bounds=]468 982 | load_image_desc_v1(fs_info, img_opt, buf_v1->head, buf_v1->fs_info, opt);469 | ^~470partclone.c:956:23: note: object 'buf_v2' of size 110471 956 | image_desc_v2 buf_v2;472 | ^~~~~~473main.c: In function 'main':474main.c:685:17: warning: ignoring return value of 'posix_memalign' declared with attribute 'warn_unused_result' [-Wunused-result]475 685 | posix_memalign((void**)&write_buffer, BSIZE, buffer_capacity * block_size);476 | ^~~~~~~~~~~~~~~~~~~~~~~~~~~~~~~~~~~~~~~~~~~~~~~~~~~~~~~~~~~~~~~~~~~~~~~~~~477gcc -DHAVE_CONFIG_H -I. -I.. -DLOCALEDIR=\"/nix/store/rv10ai8ss3h0n9qisg7jg353dhyb9r2s-partclone-0.3.38/share/locale\" -D_FILE_OFFSET_BITS=64 -DNILFS -g -O2 -Wall -c -o partclone_nilfs2-torrent_helper.o `test -f 'torrent_helper.c' || echo './'`torrent_helper.c478partclone.c:956:23: note: object 'buf_v2' of size 110479 956 | image_desc_v2 buf_v2;480 | ^~~~~~481gcc -DHAVE_CONFIG_H -I. -I.. -DLOCALEDIR=\"/nix/store/rv10ai8ss3h0n9qisg7jg353dhyb9r2s-partclone-0.3.38/share/locale\" -D_FILE_OFFSET_BITS=64 -DNILFS -g -O2 -Wall -c -o partclone_nilfs2-nilfsclone.o `test -f 'nilfsclone.c' || echo './'`nilfsclone.c482gcc -DHAVE_CONFIG_H -I. -I.. -DLOCALEDIR=\"/nix/store/rv10ai8ss3h0n9qisg7jg353dhyb9r2s-partclone-0.3.38/share/locale\" -D_FILE_OFFSET_BITS=64 -DFAT -g -O2 -Wall -c -o partclone_fat-main.o `test -f 'main.c' || echo './'`main.c483gcc -DHAVE_CONFIG_H -I. -I.. -DLOCALEDIR=\"/nix/store/rv10ai8ss3h0n9qisg7jg353dhyb9r2s-partclone-0.3.38/share/locale\" -D_FILE_OFFSET_BITS=64 -DFAT -g -O2 -Wall -c -o partclone_fat-partclone.o `test -f 'partclone.c' || echo './'`partclone.c484gcc -DHAVE_CONFIG_H -I. -I.. -DLOCALEDIR=\"/nix/store/rv10ai8ss3h0n9qisg7jg353dhyb9r2s-partclone-0.3.38/share/locale\" -D_FILE_OFFSET_BITS=64 -DFAT -g -O2 -Wall -c -o partclone_fat-progress.o `test -f 'progress.c' || echo './'`progress.c485gcc -DHAVE_CONFIG_H -I. -I.. -DLOCALEDIR=\"/nix/store/rv10ai8ss3h0n9qisg7jg353dhyb9r2s-partclone-0.3.38/share/locale\" -D_FILE_OFFSET_BITS=64 -DFAT -g -O2 -Wall -c -o partclone_fat-checksum.o `test -f 'checksum.c' || echo './'`checksum.c486gcc -DHAVE_CONFIG_H -I. -I.. -DLOCALEDIR=\"/nix/store/rv10ai8ss3h0n9qisg7jg353dhyb9r2s-partclone-0.3.38/share/locale\" -D_FILE_OFFSET_BITS=64 -DFAT -g -O2 -Wall -c -o partclone_fat-torrent_helper.o `test -f 'torrent_helper.c' || echo './'`torrent_helper.c487gcc -DHAVE_CONFIG_H -I. -I.. -DLOCALEDIR=\"/nix/store/rv10ai8ss3h0n9qisg7jg353dhyb9r2s-partclone-0.3.38/share/locale\" -D_FILE_OFFSET_BITS=64 -DFAT -g -O2 -Wall -c -o partclone_fat-fatclone.o `test -f 'fatclone.c' || echo './'`fatclone.c488gcc -DHAVE_CONFIG_H -I. -I.. -DLOCALEDIR=\"/nix/store/rv10ai8ss3h0n9qisg7jg353dhyb9r2s-partclone-0.3.38/share/locale\" -D_FILE_OFFSET_BITS=64 -D_FILE_OFFSET_BITS=64 -g -O2 -Wall -c -o ntfsfixboot.o ntfsfixboot.c489gcc -DHAVE_CONFIG_H -I. -I.. -DLOCALEDIR=\"/nix/store/rv10ai8ss3h0n9qisg7jg353dhyb9r2s-partclone-0.3.38/share/locale\" -D_FILE_OFFSET_BITS=64 -DNTFS3G -g -O2 -Wall -c -o partclone_ntfs-main.o `test -f 'main.c' || echo './'`main.c490gcc -DHAVE_CONFIG_H -I. -I.. -DLOCALEDIR=\"/nix/store/rv10ai8ss3h0n9qisg7jg353dhyb9r2s-partclone-0.3.38/share/locale\" -D_FILE_OFFSET_BITS=64 -DNTFS3G -g -O2 -Wall -c -o partclone_ntfs-partclone.o `test -f 'partclone.c' || echo './'`partclone.c491gcc -DHAVE_CONFIG_H -I. -I.. -DLOCALEDIR=\"/nix/store/rv10ai8ss3h0n9qisg7jg353dhyb9r2s-partclone-0.3.38/share/locale\" -D_FILE_OFFSET_BITS=64 -DNTFS3G -g -O2 -Wall -c -o partclone_ntfs-progress.o `test -f 'progress.c' || echo './'`progress.c492gcc -DHAVE_CONFIG_H -I. -I.. -DLOCALEDIR=\"/nix/store/rv10ai8ss3h0n9qisg7jg353dhyb9r2s-partclone-0.3.38/share/locale\" -D_FILE_OFFSET_BITS=64 -DNTFS3G -g -O2 -Wall -c -o partclone_ntfs-checksum.o `test -f 'checksum.c' || echo './'`checksum.c493gcc -DHAVE_CONFIG_H -I. -I.. -DLOCALEDIR=\"/nix/store/rv10ai8ss3h0n9qisg7jg353dhyb9r2s-partclone-0.3.38/share/locale\" -D_FILE_OFFSET_BITS=64 -DNTFS3G -g -O2 -Wall -c -o partclone_ntfs-torrent_helper.o `test -f 'torrent_helper.c' || echo './'`torrent_helper.c494nilfsclone.c: In function 'lssu_print_suinfo':495nilfsclone.c:72:17: warning: this 'if' clause does not guard... [-Wmisleading-indentation]496 72 | if (!all && nilfs_suinfo_clean(&suinfos[i]))497 | ^~498nilfsclone.c:75:25: note: ...this statement, but the latter is misleadingly indented as if it were guarded by the 'if'499 75 | log_mesg(3, 0, 0, fs_opt.debug, "%s: seg %llu, %c %c %c , %i\n",500 | ^~~~~~~~501nilfsclone.c: In function 'read_super_blocks':502nilfsclone.c:177:16: error: invalid use of undefined type 'struct nilfs'503 177 | sbp = nilfs->n_sb;504 | ^~505nilfsclone.c:181:31: error: invalid use of undefined type 'struct nilfs_super_block'506 181 | fs_info->totalblock = sbp->s_dev_size / fs_info->block_size;507 | ^~508nilfsclone.c:182:53: error: invalid use of undefined type 'struct nilfs_super_block'509 182 | fs_info->usedblocks = fs_info->totalblock - sbp->s_free_blocks_count;510 | ^~511nilfsclone.c:184:31: error: invalid use of undefined type 'struct nilfs_super_block'512 184 | fs_info->device_size = sbp->s_dev_size;513 | ^~514gcc -DHAVE_CONFIG_H -I. -I.. -DLOCALEDIR=\"/nix/store/rv10ai8ss3h0n9qisg7jg353dhyb9r2s-partclone-0.3.38/share/locale\" -D_FILE_OFFSET_BITS=64 -DNTFS3G -g -O2 -Wall -c -o partclone_ntfs-ntfsclone-ng.o `test -f 'ntfsclone-ng.c' || echo './'`ntfsclone-ng.c515gcc -DHAVE_CONFIG_H -I. -I.. -DLOCALEDIR=\"/nix/store/rv10ai8ss3h0n9qisg7jg353dhyb9r2s-partclone-0.3.38/share/locale\" -D_FILE_OFFSET_BITS=64 -std=gnu11 -DBTRFS -DBTRFS_FLAT_INCLUDES -D_XOPEN_SOURCE=700 -D_GNU_SOURCE -DCRYPTOPROVIDER_BUILTIN=1 -I./btrfs -I./btrfs/include -I./btrfs/libbtrfsutil -g -O2 -Wall -c -o partclone_btrfs-main.o `test -f 'main.c' || echo './'`main.c516gcc -DHAVE_CONFIG_H -I. -I.. -DLOCALEDIR=\"/nix/store/rv10ai8ss3h0n9qisg7jg353dhyb9r2s-partclone-0.3.38/share/locale\" -D_FILE_OFFSET_BITS=64 -std=gnu11 -DBTRFS -DBTRFS_FLAT_INCLUDES -D_XOPEN_SOURCE=700 -D_GNU_SOURCE -DCRYPTOPROVIDER_BUILTIN=1 -I./btrfs -I./btrfs/include -I./btrfs/libbtrfsutil -g -O2 -Wall -c -o partclone_btrfs-partclone.o `test -f 'partclone.c' || echo './'`partclone.c517gcc -DHAVE_CONFIG_H -I. -I.. -DLOCALEDIR=\"/nix/store/rv10ai8ss3h0n9qisg7jg353dhyb9r2s-partclone-0.3.38/share/locale\" -D_FILE_OFFSET_BITS=64 -std=gnu11 -DBTRFS -DBTRFS_FLAT_INCLUDES -D_XOPEN_SOURCE=700 -D_GNU_SOURCE -DCRYPTOPROVIDER_BUILTIN=1 -I./btrfs -I./btrfs/include -I./btrfs/libbtrfsutil -g -O2 -Wall -c -o partclone_btrfs-progress.o `test -f 'progress.c' || echo './'`progress.c518gcc -DHAVE_CONFIG_H -I. -I.. -DLOCALEDIR=\"/nix/store/rv10ai8ss3h0n9qisg7jg353dhyb9r2s-partclone-0.3.38/share/locale\" -D_FILE_OFFSET_BITS=64 -std=gnu11 -DBTRFS -DBTRFS_FLAT_INCLUDES -D_XOPEN_SOURCE=700 -D_GNU_SOURCE -DCRYPTOPROVIDER_BUILTIN=1 -I./btrfs -I./btrfs/include -I./btrfs/libbtrfsutil -g -O2 -Wall -c -o partclone_btrfs-checksum.o `test -f 'checksum.c' || echo './'`checksum.c519gcc -DHAVE_CONFIG_H -I. -I.. -DLOCALEDIR=\"/nix/store/rv10ai8ss3h0n9qisg7jg353dhyb9r2s-partclone-0.3.38/share/locale\" -D_FILE_OFFSET_BITS=64 -std=gnu11 -DBTRFS -DBTRFS_FLAT_INCLUDES -D_XOPEN_SOURCE=700 -D_GNU_SOURCE -DCRYPTOPROVIDER_BUILTIN=1 -I./btrfs -I./btrfs/include -I./btrfs/libbtrfsutil -g -O2 -Wall -c -o partclone_btrfs-torrent_helper.o `test -f 'torrent_helper.c' || echo './'`torrent_helper.c520gcc -DHAVE_CONFIG_H -I. -I.. -DLOCALEDIR=\"/nix/store/rv10ai8ss3h0n9qisg7jg353dhyb9r2s-partclone-0.3.38/share/locale\" -D_FILE_OFFSET_BITS=64 -std=gnu11 -DBTRFS -DBTRFS_FLAT_INCLUDES -D_XOPEN_SOURCE=700 -D_GNU_SOURCE -DCRYPTOPROVIDER_BUILTIN=1 -I./btrfs -I./btrfs/include -I./btrfs/libbtrfsutil -g -O2 -Wall -c -o partclone_btrfs-btrfsclone.o `test -f 'btrfsclone.c' || echo './'`btrfsclone.c521make[2]: *** [Makefile:4455: partclone_nilfs2-nilfsclone.o] Error 1522make[2]: *** Waiting for unfinished jobs....523partclone.c: In function 'load_image_desc':524partclone.c:982:60: warning: array subscript 'image_desc_v1[0]' is partly outside array bounds of 'image_desc_v2[1]' [-Warray-bounds=]525 982 | load_image_desc_v1(fs_info, img_opt, buf_v1->head, buf_v1->fs_info, opt);526 | ^~527partclone.c:956:23: note: object 'buf_v2' of size 110528 956 | image_desc_v2 buf_v2;529 | ^~~~~~530partclone.c:982:74: warning: array subscript 'image_desc_v1[0]' is partly outside array bounds of 'image_desc_v2[1]' [-Warray-bounds=]531 982 | load_image_desc_v1(fs_info, img_opt, buf_v1->head, buf_v1->fs_info, opt);532 | ^~533partclone.c:956:23: note: object 'buf_v2' of size 110534 956 | image_desc_v2 buf_v2;535 | ^~~~~~536main.c: In function 'main':537main.c:685:17: warning: ignoring return value of 'posix_memalign' declared with attribute 'warn_unused_result' [-Wunused-result]538 685 | posix_memalign((void**)&write_buffer, BSIZE, buffer_capacity * block_size);539 | ^~~~~~~~~~~~~~~~~~~~~~~~~~~~~~~~~~~~~~~~~~~~~~~~~~~~~~~~~~~~~~~~~~~~~~~~~~540In file included from /nix/store/lbjwxax9n0457lgd83rqwpd1l9lgfl7r-glibc-2.42-84-dev/include/string.h:548,541 from fatclone.c:20:542In function 'memcpy',543 inlined from 'fs_open' at fatclone.c:296:5:544/nix/store/lbjwxax9n0457lgd83rqwpd1l9lgfl7r-glibc-2.42-84-dev/include/bits/string_fortified.h:29:10: warning: '*(unsigned char (*)[512])buffer' may be used uninitialized [-Wmaybe-uninitialized]545 29 | return __builtin___memcpy_chk (__dest, __src, __len,546 | ^~~~~~~~~~~~~~~~~~~~~~~~~~~~~~~~~~~~~~~~~~~~~547 30 | __glibc_objsize0 (__dest));548 | ~~~~~~~~~~~~~~~~~~~~~~~~~~549In file included from /nix/store/lbjwxax9n0457lgd83rqwpd1l9lgfl7r-glibc-2.42-84-dev/include/features.h:524,550 from /nix/store/lbjwxax9n0457lgd83rqwpd1l9lgfl7r-glibc-2.42-84-dev/include/bits/libc-header-start.h:33,551 from /nix/store/lbjwxax9n0457lgd83rqwpd1l9lgfl7r-glibc-2.42-84-dev/include/stdio.h:28,552 from fatclone.c:15:553In function 'read',554 inlined from 'fs_open' at fatclone.c:283:8:555/nix/store/lbjwxax9n0457lgd83rqwpd1l9lgfl7r-glibc-2.42-84-dev/include/bits/unistd.h:32:10: warning: argument 2 is null but the corresponding size argument 3 value is 512 [-Wnonnull]556 32 | return __glibc_fortify (read, __nbytes, sizeof (char),557 | ^~~~~~~~~~~~~~~558/nix/store/lbjwxax9n0457lgd83rqwpd1l9lgfl7r-glibc-2.42-84-dev/include/bits/unistd-decl.h: In function 'fs_open':559/nix/store/lbjwxax9n0457lgd83rqwpd1l9lgfl7r-glibc-2.42-84-dev/include/bits/unistd-decl.h:29:16: note: in a call to function '__read_alias' declared with attribute 'access (write_only, 2, 3)'560 29 | extern ssize_t __REDIRECT_FORTIFY (__read_alias, (int __fd, void *__buf,561 | ^~~~~~~~~~~~~~~~~~562main.c: In function 'main':563main.c:685:17: warning: ignoring return value of 'posix_memalign' declared with attribute 'warn_unused_result' [-Wunused-result]564 685 | posix_memalign((void**)&write_buffer, BSIZE, buffer_capacity * block_size);565 | ^~~~~~~~~~~~~~~~~~~~~~~~~~~~~~~~~~~~~~~~~~~~~~~~~~~~~~~~~~~~~~~~~~~~~~~~~~566In file included from partclone.h:23,567 from btrfsclone.c:34:568bitmap.h:7:9: warning: 'BITS_TO_LONGS' redefined569 7 | #define BITS_TO_LONGS(bits) (((bits)+PART_BITS_PER_LONG-1)/PART_BITS_PER_LONG)570 | ^~~~~~~~~~~~~571In file included from ./btrfs/kernel-shared/extent_io.h:23,572 from btrfs/kernel-shared/ctree.h:29,573 from btrfsclone.c:25:574./btrfs/kernel-lib/bitops.h:13:9: note: this is the location of the previous definition575 13 | #define BITS_TO_LONGS(nr) DIV_ROUND_UP(nr, BITS_PER_BYTE * sizeof(long))576 | ^~~~~~~~~~~~~577btrfsclone.c: In function 'dump_start_leaf':578btrfsclone.c:259:9: warning: unused variable 'root_eb_level' [-Wunused-variable]579 259 | int root_eb_level = btrfs_header_level(eb);580 | ^~~~~~~~~~~~~581main.c: In function 'main':582main.c:685:17: warning: ignoring return value of 'posix_memalign' declared with attribute 'warn_unused_result' [-Wunused-result]583 685 | posix_memalign((void**)&write_buffer, BSIZE, buffer_capacity * block_size);584 | ^~~~~~~~~~~~~~~~~~~~~~~~~~~~~~~~~~~~~~~~~~~~~~~~~~~~~~~~~~~~~~~~~~~~~~~~~~585partclone.c: In function 'load_image_desc':586partclone.c:982:60: warning: array subscript 'image_desc_v1[0]' is partly outside array bounds of 'image_desc_v2[1]' [-Warray-bounds=]587 982 | load_image_desc_v1(fs_info, img_opt, buf_v1->head, buf_v1->fs_info, opt);588 | ^~589partclone.c:956:23: note: object 'buf_v2' of size 110590 956 | image_desc_v2 buf_v2;591 | ^~~~~~592partclone.c:982:74: warning: array subscript 'image_desc_v1[0]' is partly outside array bounds of 'image_desc_v2[1]' [-Warray-bounds=]593 982 | load_image_desc_v1(fs_info, img_opt, buf_v1->head, buf_v1->fs_info, opt);594 | ^~595partclone.c:956:23: note: object 'buf_v2' of size 110596 956 | image_desc_v2 buf_v2;597 | ^~~~~~598partclone.c: In function 'load_image_desc':599partclone.c:982:60: warning: array subscript 'image_desc_v1[0]' is partly outside array bounds of 'image_desc_v2[1]' [-Warray-bounds=]600 982 | load_image_desc_v1(fs_info, img_opt, buf_v1->head, buf_v1->fs_info, opt);601 | ^~602partclone.c:956:23: note: object 'buf_v2' of size 110603 956 | image_desc_v2 buf_v2;604 | ^~~~~~605partclone.c:982:74: warning: array subscript 'image_desc_v1[0]' is partly outside array bounds of 'image_desc_v2[1]' [-Warray-bounds=]606 982 | load_image_desc_v1(fs_info, img_opt, buf_v1->head, buf_v1->fs_info, opt);607 | ^~608partclone.c:956:23: note: object 'buf_v2' of size 110609 956 | image_desc_v2 buf_v2;610 | ^~~~~~611partclone.c: In function 'load_image_desc':612partclone.c:982:60: warning: array subscript 'image_desc_v1[0]' is partly outside array bounds of 'image_desc_v2[1]' [-Warray-bounds=]613 982 | load_image_desc_v1(fs_info, img_opt, buf_v1->head, buf_v1->fs_info, opt);614 | ^~615partclone.c:956:23: note: object 'buf_v2' of size 110616 956 | image_desc_v2 buf_v2;617 | ^~~~~~618partclone.c:982:74: warning: array subscript 'image_desc_v1[0]' is partly outside array bounds of 'image_desc_v2[1]' [-Warray-bounds=]619 982 | load_image_desc_v1(fs_info, img_opt, buf_v1->head, buf_v1->fs_info, opt);620 | ^~621partclone.c:956:23: note: object 'buf_v2' of size 110622 956 | image_desc_v2 buf_v2;623 | ^~~~~~624make[2]: Leaving directory '/build/source/src'625make[1]: *** [Makefile:413: all-recursive] Error 1626make[1]: Leaving directory '/build/source'627make: *** [Makefile:354: all] Error 2