nixbot

builds

failed trunk-0.21.14 checks.x86_64-linux.nixos-eta · build #615 · raw

unpackPhase
1unpacking source archive /nix/store/dgiy35wd1klh93l6kc4zpy85abhzhp5s-source2source root is source3Executing cargoSetupPostUnpackHook4Finished cargoSetupPostUnpackHook
patchPhase
5Executing cargoSetupPostPatchHook6Validating consistency between /build/source/Cargo.lock and /build/trunk-0.21.14-vendor/Cargo.lock7Finished cargoSetupPostPatchHook
buildPhase
8Executing cargoBuildHook9cargoBuildHook flags: -j 48 --target x86_64-unknown-linux-gnu --offline --profile release10 Compiling proc-macro2 v1.0.9411 Compiling unicode-ident v1.0.1812 Compiling libc v0.2.17113 Compiling cfg-if v1.0.014 Compiling portable-atomic v1.11.015 Compiling critical-section v1.2.016 Compiling log v0.4.2717 Compiling autocfg v1.4.018 Compiling shlex v1.3.019 Compiling smallvec v1.15.020 Compiling serde v1.0.21921 Compiling version_check v0.9.522 Compiling memchr v2.7.423 Compiling itoa v1.0.1524 Compiling crossbeam-utils v0.8.2125 Compiling pin-project-lite v0.2.1626 Compiling parking_lot_core v0.9.1027 Compiling scopeguard v1.2.028 Compiling zerocopy v0.8.2429 Compiling bytes v1.10.130 Compiling syn v1.0.10931 Compiling futures-core v0.3.3132 Compiling bitflags v2.9.033 Compiling stable_deref_trait v1.2.034 Compiling either v1.15.035 Compiling rayon-core v1.12.136 Compiling futures-sink v0.3.3137 Compiling hashbrown v0.15.238 Compiling equivalent v1.0.239 Compiling typenum v1.18.040 Compiling futures-task v0.3.3141 Compiling pin-utils v0.1.042 Compiling fnv v1.0.743 Compiling futures-io v0.3.3144 Compiling subtle v2.6.145 Compiling getrandom v0.1.1646 Compiling pkg-config v0.3.3247 Compiling untrusted v0.9.048 Compiling litemap v0.7.549 Compiling rustls-pki-types v1.11.050 Compiling writeable v0.5.551 Compiling getrandom v0.3.252 Compiling icu_locid_transform_data v1.5.153 Compiling siphasher v1.0.154 Compiling icu_properties_data v1.5.155 Compiling rand_core v0.6.456 Compiling ryu v1.0.2057 Compiling icu_normalizer_data v1.5.158 Compiling httparse v1.10.159 Compiling serde_json v1.0.14060 Compiling rustls v0.23.2561 Compiling siphasher v0.3.1162 Compiling percent-encoding v2.3.163 Compiling utf16_iter v1.0.564 Compiling utf8_iter v1.0.465 Compiling write16 v1.0.066 Compiling dtoa v1.0.1067 Compiling futures-channel v0.3.3168 Compiling rand v0.8.569 Compiling tower-service v0.3.370 Compiling lazy_static v1.5.071 Compiling thiserror v2.0.1272 Compiling form_urlencoded v1.2.173 Compiling generic-array v0.14.774 Compiling phf_shared v0.8.075 Compiling phf_shared v0.11.376 Compiling ahash v0.8.1177 Compiling atomic-waker v1.1.278 Compiling rustix v1.0.579 Compiling try-lock v0.2.580 Compiling bumpalo v3.17.081 Compiling httpdate v1.0.382 Compiling heck v0.5.083 Compiling ahash v0.7.884 Compiling data-encoding v2.8.085 Compiling matches v0.1.1086 Compiling proc-macro-hack v0.5.20+deprecated87 Compiling linux-raw-sys v0.9.388 Compiling byteorder v1.5.089 Compiling cpufeatures v0.2.1790 Compiling zerocopy v0.7.3591 Compiling mime v0.3.1792 Compiling cfg_aliases v0.2.193 Compiling thiserror v1.0.6994 Compiling tower-layer v0.3.395 Compiling utf8parse v0.2.296 Compiling rustversion v1.0.2097 Compiling openssl-probe v0.1.698 Compiling sync_wrapper v1.0.299 Compiling dtoa-short v0.3.5100 Compiling anstyle v1.0.10101 Compiling colorchoice v1.0.3102 Compiling phf_generator v0.11.3103 Compiling want v0.3.1104 Compiling precomputed-hash v0.1.1105 Compiling nix v0.29.0106 Compiling rustls-native-certs v0.8.1107 Compiling anstyle-query v1.1.2108 Compiling is_terminal_polyfill v1.70.1109 Compiling rkyv v0.7.45110 Compiling outref v0.1.0111 Compiling itertools v0.12.1112 Compiling aho-corasick v0.7.20113 Compiling crc32fast v1.4.2114 Compiling semver v1.0.26115 Compiling anstyle-parse v0.2.6116 Compiling simd-abstraction v0.7.1117 Compiling rustc-hash v2.1.1118 Compiling unicase v2.8.1119 Compiling phf_codegen v0.11.3120 Compiling radium v0.7.0121 Compiling ipnet v2.11.0122 Compiling paste v1.0.15123 Compiling zstd-safe v7.2.4124 Compiling unicode-segmentation v1.12.0125 Compiling crossbeam-epoch v0.9.18126 Compiling anstream v0.6.18127 Compiling parcel_selectors v0.28.1128 Compiling seahash v4.1.0129 Compiling crossbeam-channel v0.5.14130 Compiling base64-simd v0.7.0131 Compiling data-url v0.1.1132 Compiling lock_api v0.4.12133 Compiling slab v0.4.9134 Compiling num-traits v0.2.19135 Compiling fs-err v3.1.0136 Compiling aho-corasick v1.1.3137 Compiling rustls-pemfile v2.2.0138 Compiling webpki-roots v0.26.8139 Compiling crc-catalog v2.4.0140 Compiling once_cell v1.21.3141 Compiling moka v0.12.10142 Compiling mime_guess v2.0.5143 Compiling rustix v0.38.44144 Compiling same-file v1.0.6145 Compiling winnow v0.7.4146 Compiling regex-syntax v0.8.5147 Compiling hashbrown v0.14.5148 Compiling powerfmt v0.2.0149 Compiling tinyvec_macros v0.1.1150 Compiling convert_case v0.6.0151 Compiling utf-8 v0.7.6152 Compiling pathdiff v0.2.3153 Compiling http v1.3.1154 Compiling nodrop v0.1.14155 Compiling vlq v0.5.1156 Compiling simd-adler32 v0.3.7157 Compiling clap_lex v0.7.4158 Compiling lockfree-object-pool v0.1.6159 Compiling regex-syntax v0.6.29160 Compiling adler2 v2.0.0161 Compiling itoa v0.4.8162 Compiling camino v1.1.9163 Compiling strsim v0.11.1164 Compiling convert_case v0.4.0165 Compiling base64 v0.22.1166 Compiling tap v1.0.1167 Compiling servo_arc v0.1.1168 Compiling walkdir v2.5.0169 Compiling quote v1.0.40170 Compiling wyz v0.5.1171 Compiling crossbeam-deque v0.8.6172 Compiling tinyvec v1.9.0173 Compiling crc v3.2.1174 Compiling fxhash v0.2.1175 Compiling itertools v0.10.5176 Compiling miniz_oxide v0.8.7177 Compiling env_filter v0.1.3178 Compiling tracing-core v0.1.33179 Compiling is-docker v0.2.0180 Compiling zopfli v0.8.1181 Compiling getrandom v0.2.15182 Compiling syn v2.0.100183 Compiling mio v1.0.3184 Compiling socket2 v0.5.9185 Compiling signal-hook-registry v1.4.2186 Compiling filetime v0.2.25187 Compiling inotify-sys v0.1.5188 Compiling parking_lot v0.12.3189 Compiling ppv-lite86 v0.2.21190 Compiling dashmap v5.5.3191 Compiling rand_core v0.9.3192 Compiling inotify v0.11.0193 Compiling uuid v1.16.0194 Compiling hostname v0.4.0195 Compiling cvt v0.1.2196 Compiling tagptr v0.2.0197 Compiling http-body v1.0.1198 Compiling bitflags v1.3.2199 Compiling bytemuck v1.22.0200 Compiling zip v2.6.1201 Compiling hashbrown v0.12.3202 Compiling rustc-hash v1.1.0203 Compiling option-ext v0.2.0204 Compiling linux-raw-sys v0.4.15205 Compiling thin-slice v0.1.1206 Compiling http-body-util v0.1.3207 Compiling crypto-common v0.1.6208 Compiling block-buffer v0.10.4209 Compiling inout v0.1.4210 Compiling time-core v0.1.4211 Compiling jobserver v0.1.33212 Compiling notify-types v2.0.0213 Compiling num-conv v0.1.0214 Compiling schemars v0.8.22215 Compiling overload v0.1.1216 Compiling anyhow v1.0.97217 Compiling funty v2.0.0218 Compiling hashbrown v0.13.2219 Compiling rgb v0.8.50220 Compiling dirs-sys v0.5.0221 Compiling cipher v0.4.4222 Compiling lzma-rs v0.3.0223 Compiling nu-ansi-term v0.46.0224 Compiling digest v0.10.7225 Compiling resolv-conf v0.7.1226 Compiling flate2 v1.1.1227 Compiling env_logger v0.11.8228 Compiling rayon v1.10.0229 Compiling rand_core v0.5.1230 Compiling tracing-log v0.2.0231 Compiling is-wsl v0.4.0232 Compiling thread_local v1.1.8233 Compiling sha1 v0.10.6234 Compiling hmac v0.12.1235 Compiling notify v8.0.0236 Compiling sharded-slab v0.1.7237 Compiling encoding_rs v0.8.35238 Compiling rand_chacha v0.2.2239 Compiling rand_pcg v0.2.1240 Compiling pbkdf2 v0.12.2241 Compiling humantime v2.2.0242 Compiling env_home v0.1.0243 Compiling cc v1.2.18244 Compiling http-range-header v0.4.2245 Compiling lazycell v1.3.0246 Compiling unicode-width v0.2.0247 Compiling deflate64 v0.1.9248 Compiling normpath v1.3.0249 Compiling constant_time_eq v0.3.1250 Compiling matchit v0.8.4251 Compiling arc-swap v1.7.1252 Compiling unsafe-libyaml v0.2.11253 Compiling rand v0.7.3254 Compiling aes v0.8.4255 Compiling file-id v0.2.2256 Compiling dyn-clone v1.0.19257 Compiling open v5.3.2258 Compiling console v0.15.11259 Compiling sha2 v0.10.8260 Compiling directories v6.0.0261 Compiling dunce v1.0.5262 Compiling htmlescape v0.3.1263 Compiling rand_chacha v0.9.0264 Compiling notify-debouncer-full v0.5.0265 Compiling rand v0.9.0266 Compiling parse-js v0.17.0267 Compiling fs_at v0.2.1268 Compiling homedir v0.3.4269 Compiling regex-automata v0.1.10270 Compiling bitvec v1.0.1271 Compiling regex-automata v0.4.9272 Compiling remove_dir_all v1.0.0273 Compiling phf_generator v0.8.0274 Compiling phf_codegen v0.8.0275 Compiling selectors v0.22.0276 Compiling matchers v0.1.0277 Compiling minify-js v0.5.6278 Compiling ring v0.17.14279 Compiling zstd-sys v2.0.15+zstd.1.5.7280 Compiling lzma-sys v0.1.20281 Compiling libdeflate-sys v1.23.1282 Compiling bzip2-sys v0.1.13+1.0.8283 Compiling which v7.0.2284 Compiling terminal_size v0.4.2285 Compiling xattr v1.5.0286 Compiling clap_builder v4.5.35287 Compiling tar v0.4.44288 Compiling regex v1.11.1289 Compiling ptr_meta_derive v0.1.4290 Compiling cssparser v0.27.2291 Compiling rkyv_derive v0.7.45292 Compiling phf_macros v0.8.0293 Compiling const-str-proc-macro v0.3.2294 Compiling lightningcss-derive v1.0.0-alpha.43295 Compiling synstructure v0.13.1296 Compiling serde_derive_internals v0.29.1297 Compiling ptr_meta v0.1.4298 Compiling xz2 v0.1.7299 Compiling serde_derive v1.0.219300 Compiling tokio-macros v2.5.0301 Compiling zerofrom-derive v0.1.6302 Compiling yoke-derive v0.7.5303 Compiling zerovec-derive v0.10.3304 Compiling displaydoc v0.2.5305 Compiling futures-macro v0.3.31306 Compiling tracing-attributes v0.1.28307 Compiling icu_provider_macros v1.5.0308 Compiling zeroize_derive v1.4.2309 Compiling cssparser-macros v0.6.1310 Compiling thiserror-impl v2.0.12311 Compiling phf_macros v0.11.3312 Compiling thiserror-impl v1.0.69313 Compiling const-str v0.3.2314 Compiling derive_more v0.99.19315 Compiling async-trait v0.1.88316 Compiling enum-as-inner v0.6.1317 Compiling async-recursion v1.1.1318 Compiling phf v0.8.0319 Compiling clap_derive v4.5.32320 Compiling bzip2 v0.5.2321 Compiling strum_macros v0.27.1322 Compiling schemars_derive v0.8.22323 Compiling phf v0.11.3324 Compiling cssparser v0.33.0325 Compiling futures-util v0.3.31326 Compiling tokio v1.44.2327warning: libdeflate-sys@1.23.1: In file included from libdeflate/lib/adler32.c:28:328warning: libdeflate-sys@1.23.1: libdeflate/lib/x86/adler32_template.h:135:12: error: attribute 'target' argument 'no-evex512' is unknown329warning: libdeflate-sys@1.23.1: 135 | ADD_SUFFIX(reduce_to_32bits)(vec_t v_s1, vec_t v_s2, u32 *s1_p, u32 *s2_p)330warning: libdeflate-sys@1.23.1: | ^~~~~~~~~~~~~~~~331warning: libdeflate-sys@1.23.1: libdeflate/lib/lib_common.h:102:33: note: in definition of macro 'CONCAT_IMPL'332warning: libdeflate-sys@1.23.1: 102 | #define CONCAT_IMPL(a, b) a##b333warning: libdeflate-sys@1.23.1: | ^334warning: libdeflate-sys@1.23.1: libdeflate/lib/lib_common.h:104:33: note: in expansion of macro 'CONCAT'335warning: libdeflate-sys@1.23.1: 104 | #define ADD_SUFFIX(name) CONCAT(name, SUFFIX)336warning: libdeflate-sys@1.23.1: | ^~~~~~337warning: libdeflate-sys@1.23.1: libdeflate/lib/x86/adler32_template.h:135:1: note: in expansion of macro 'ADD_SUFFIX'338warning: libdeflate-sys@1.23.1: 135 | ADD_SUFFIX(reduce_to_32bits)(vec_t v_s1, vec_t v_s2, u32 *s1_p, u32 *s2_p)339warning: libdeflate-sys@1.23.1: | ^~~~~~~~~~340warning: libdeflate-sys@1.23.1: In file included from libdeflate/lib/adler32.c:128:341warning: libdeflate-sys@1.23.1: libdeflate/lib/x86/adler32_impl.h:83:41: error: attribute 'target' argument 'no-evex512' is unknown342warning: libdeflate-sys@1.23.1: 83 | # define adler32_x86_avx512_vl256_vnni adler32_x86_avx512_vl256_vnni343warning: libdeflate-sys@1.23.1: | ^~~~~~~~~~~~~~~~~~~~~~~~~~~~~344warning: libdeflate-sys@1.23.1: libdeflate/lib/lib_common.h:102:33: note: in expansion of macro 'adler32_x86_avx512_vl256_vnni'345warning: libdeflate-sys@1.23.1: 102 | #define CONCAT_IMPL(a, b) a##b346warning: libdeflate-sys@1.23.1: | ^347warning: libdeflate-sys@1.23.1: libdeflate/lib/lib_common.h:103:33: note: in expansion of macro 'CONCAT_IMPL'348warning: libdeflate-sys@1.23.1: 103 | #define CONCAT(a, b) CONCAT_IMPL(a, b)349warning: libdeflate-sys@1.23.1: | ^~~~~~~~~~~350warning: libdeflate-sys@1.23.1: libdeflate/lib/lib_common.h:104:33: note: in expansion of macro 'CONCAT'351warning: libdeflate-sys@1.23.1: 104 | #define ADD_SUFFIX(name) CONCAT(name, SUFFIX)352warning: libdeflate-sys@1.23.1: | ^~~~~~353warning: libdeflate-sys@1.23.1: libdeflate/lib/x86/adler32_template.h:183:1: note: in expansion of macro 'ADD_SUFFIX'354warning: libdeflate-sys@1.23.1: 183 | ADD_SUFFIX(adler32_x86)(u32 adler, const u8 *p, size_t len)355warning: libdeflate-sys@1.23.1: | ^~~~~~~~~~356warning: libdeflate-sys@1.23.1: libdeflate/lib/x86/adler32_template.h:135:12: error: attribute 'target' argument 'evex512' is unknown357warning: libdeflate-sys@1.23.1: 135 | ADD_SUFFIX(reduce_to_32bits)(vec_t v_s1, vec_t v_s2, u32 *s1_p, u32 *s2_p)358warning: libdeflate-sys@1.23.1: | ^~~~~~~~~~~~~~~~359warning: libdeflate-sys@1.23.1: libdeflate/lib/lib_common.h:102:33: note: in definition of macro 'CONCAT_IMPL'360warning: libdeflate-sys@1.23.1: 102 | #define CONCAT_IMPL(a, b) a##b361warning: libdeflate-sys@1.23.1: | ^362warning: libdeflate-sys@1.23.1: libdeflate/lib/lib_common.h:104:33: note: in expansion of macro 'CONCAT'363warning: libdeflate-sys@1.23.1: 104 | #define ADD_SUFFIX(name) CONCAT(name, SUFFIX)364warning: libdeflate-sys@1.23.1: | ^~~~~~365warning: libdeflate-sys@1.23.1: libdeflate/lib/x86/adler32_template.h:135:1: note: in expansion of macro 'ADD_SUFFIX'366warning: libdeflate-sys@1.23.1: 135 | ADD_SUFFIX(reduce_to_32bits)(vec_t v_s1, vec_t v_s2, u32 *s1_p, u32 *s2_p)367warning: libdeflate-sys@1.23.1: | ^~~~~~~~~~368warning: libdeflate-sys@1.23.1: libdeflate/lib/x86/adler32_impl.h:96:41: error: attribute 'target' argument 'evex512' is unknown369warning: libdeflate-sys@1.23.1: 96 | # define adler32_x86_avx512_vl512_vnni adler32_x86_avx512_vl512_vnni370warning: libdeflate-sys@1.23.1: | ^~~~~~~~~~~~~~~~~~~~~~~~~~~~~371warning: libdeflate-sys@1.23.1: libdeflate/lib/lib_common.h:102:33: note: in expansion of macro 'adler32_x86_avx512_vl512_vnni'372warning: libdeflate-sys@1.23.1: 102 | #define CONCAT_IMPL(a, b) a##b373warning: libdeflate-sys@1.23.1: | ^374warning: libdeflate-sys@1.23.1: libdeflate/lib/lib_common.h:103:33: note: in expansion of macro 'CONCAT_IMPL'375warning: libdeflate-sys@1.23.1: 103 | #define CONCAT(a, b) CONCAT_IMPL(a, b)376warning: libdeflate-sys@1.23.1: | ^~~~~~~~~~~377warning: libdeflate-sys@1.23.1: libdeflate/lib/lib_common.h:104:33: note: in expansion of macro 'CONCAT'378warning: libdeflate-sys@1.23.1: 104 | #define ADD_SUFFIX(name) CONCAT(name, SUFFIX)379warning: libdeflate-sys@1.23.1: | ^~~~~~380warning: libdeflate-sys@1.23.1: libdeflate/lib/x86/adler32_template.h:183:1: note: in expansion of macro 'ADD_SUFFIX'381warning: libdeflate-sys@1.23.1: 183 | ADD_SUFFIX(adler32_x86)(u32 adler, const u8 *p, size_t len)382warning: libdeflate-sys@1.23.1: | ^~~~~~~~~~383warning: libdeflate-sys@1.23.1: In file included from libdeflate/lib/x86/adler32_impl.h:89:384warning: libdeflate-sys@1.23.1: libdeflate/lib/x86/adler32_template.h: In function 'adler32_x86_avx512_vl256_vnni':385warning: libdeflate-sys@1.23.1: libdeflate/lib/x86/adler32_template.h:197:21: warning: AVX vector return without AVX enabled changes the ABI [-Wpsabi]386warning: libdeflate-sys@1.23.1: 197 | const vec_t ones = VSET1_8(1);387warning: libdeflate-sys@1.23.1: | ^~~~388warning: libdeflate-sys@1.23.1: libdeflate/lib/x86/adler32_template.h: In function 'reduce_to_32bits_avx512_vl256_vnni':389warning: libdeflate-sys@1.23.1: libdeflate/lib/x86/adler32_template.h:135:12: note: the ABI for passing parameters with 32-byte alignment has changed in GCC 4.6390warning: libdeflate-sys@1.23.1: 135 | ADD_SUFFIX(reduce_to_32bits)(vec_t v_s1, vec_t v_s2, u32 *s1_p, u32 *s2_p)391warning: libdeflate-sys@1.23.1: | ^~~~~~~~~~~~~~~~392warning: libdeflate-sys@1.23.1: libdeflate/lib/lib_common.h:102:33: note: in definition of macro 'CONCAT_IMPL'393warning: libdeflate-sys@1.23.1: 102 | #define CONCAT_IMPL(a, b) a##b394warning: libdeflate-sys@1.23.1: | ^395warning: libdeflate-sys@1.23.1: libdeflate/lib/lib_common.h:104:33: note: in expansion of macro 'CONCAT'396warning: libdeflate-sys@1.23.1: 104 | #define ADD_SUFFIX(name) CONCAT(name, SUFFIX)397warning: libdeflate-sys@1.23.1: | ^~~~~~398warning: libdeflate-sys@1.23.1: libdeflate/lib/x86/adler32_template.h:135:1: note: in expansion of macro 'ADD_SUFFIX'399warning: libdeflate-sys@1.23.1: 135 | ADD_SUFFIX(reduce_to_32bits)(vec_t v_s1, vec_t v_s2, u32 *s1_p, u32 *s2_p)400warning: libdeflate-sys@1.23.1: | ^~~~~~~~~~401warning: libdeflate-sys@1.23.1: In file included from libdeflate/lib/x86/adler32_impl.h:102:402warning: libdeflate-sys@1.23.1: libdeflate/lib/x86/adler32_template.h: In function 'adler32_x86_avx512_vl512_vnni':403warning: libdeflate-sys@1.23.1: libdeflate/lib/x86/adler32_template.h:197:21: warning: AVX512F vector return without AVX512F enabled changes the ABI [-Wpsabi]404warning: libdeflate-sys@1.23.1: 197 | const vec_t ones = VSET1_8(1);405warning: libdeflate-sys@1.23.1: | ^~~~406warning: libdeflate-sys@1.23.1: ToolExecError: command did not execute successfully (status code exit status: 1): LC_ALL="C" "/nix/store/j1938gsbvbhkyz4kbmvjk56r479mkw3s-gcc-wrapper-16.2.0/bin/cc" "-O3" "-ffunction-sections" "-fdata-sections" "-fPIC" "-m64" "-I" "libdeflate" "-fno-omit-frame-pointer" "-o" "/build/source/target/x86_64-unknown-linux-gnu/release/build/libdeflate-sys-e17dcf852e22f5bb/out/lib/81d37bb229f1c0d9-adler32.o" "-c" "libdeflate/lib/adler32.c"cargo:warning=In file included from libdeflate/lib/crc32.c:171:407warning: libdeflate-sys@1.23.1: libdeflate/lib/x86/crc32_pclmul_template.h:106:12: error: attribute 'target' argument 'no-evex512' is unknown408warning: libdeflate-sys@1.23.1: 106 | ADD_SUFFIX(fold_vec128)(__m128i src, __m128i dst, __m128i /* __v2du */ mults)409warning: libdeflate-sys@1.23.1: | ^~~~~~~~~~~410warning: libdeflate-sys@1.23.1: libdeflate/lib/lib_common.h:102:33: note: in definition of macro 'CONCAT_IMPL'411warning: libdeflate-sys@1.23.1: 102 | #define CONCAT_IMPL(a, b) a##b412warning: libdeflate-sys@1.23.1: | ^413warning: libdeflate-sys@1.23.1: libdeflate/lib/lib_common.h:104:33: note: in expansion of macro 'CONCAT'414warning: libdeflate-sys@1.23.1: 104 | #define ADD_SUFFIX(name) CONCAT(name, SUFFIX)415warning: libdeflate-sys@1.23.1: | ^~~~~~416warning: libdeflate-sys@1.23.1: libdeflate/lib/x86/crc32_pclmul_template.h:106:1: note: in expansion of macro 'ADD_SUFFIX'417warning: libdeflate-sys@1.23.1: 106 | ADD_SUFFIX(fold_vec128)(__m128i src, __m128i dst, __m128i /* __v2du */ mults)418warning: libdeflate-sys@1.23.1: | ^~~~~~~~~~419warning: libdeflate-sys@1.23.1: libdeflate/lib/x86/crc32_pclmul_template.h:117:12: error: attribute 'target' argument 'no-evex512' is unknown420warning: libdeflate-sys@1.23.1: 117 | ADD_SUFFIX(fold_vec256)(__m256i src, __m256i dst, __m256i /* __v4du */ mults)421warning: libdeflate-sys@1.23.1: | ^~~~~~~~~~~422warning: libdeflate-sys@1.23.1: libdeflate/lib/lib_common.h:102:33: note: in definition of macro 'CONCAT_IMPL'423warning: libdeflate-sys@1.23.1: 102 | #define CONCAT_IMPL(a, b) a##b424warning: libdeflate-sys@1.23.1: | ^425warning: libdeflate-sys@1.23.1: libdeflate/lib/lib_common.h:104:33: note: in expansion of macro 'CONCAT'426warning: libdeflate-sys@1.23.1: 104 | #define ADD_SUFFIX(name) CONCAT(name, SUFFIX)427warning: libdeflate-sys@1.23.1: | ^~~~~~428warning: libdeflate-sys@1.23.1: libdeflate/lib/x86/crc32_pclmul_template.h:117:1: note: in expansion of macro 'ADD_SUFFIX'429warning: libdeflate-sys@1.23.1: 117 | ADD_SUFFIX(fold_vec256)(__m256i src, __m256i dst, __m256i /* __v4du */ mults)430warning: libdeflate-sys@1.23.1: | ^~~~~~~~~~431warning: libdeflate-sys@1.23.1: In file included from libdeflate/lib/x86/crc32_impl.h:110,432warning: libdeflate-sys@1.23.1: from libdeflate/lib/crc32.c:228:433warning: libdeflate-sys@1.23.1: libdeflate/lib/x86/crc32_pclmul_template.h: In function 'fold_vec256_vpclmulqdq_avx512_vl256':434warning: libdeflate-sys@1.23.1: libdeflate/lib/x86/crc32_pclmul_template.h:118:1: warning: AVX vector return without AVX enabled changes the ABI [-Wpsabi]435warning: libdeflate-sys@1.23.1: 118 | {436warning: libdeflate-sys@1.23.1: | ^437warning: libdeflate-sys@1.23.1: libdeflate/lib/x86/crc32_pclmul_template.h: At top level:438warning: libdeflate-sys@1.23.1: libdeflate/lib/x86/crc32_pclmul_template.h:160:12: error: attribute 'target' argument 'no-evex512' is unknown439warning: libdeflate-sys@1.23.1: 160 | ADD_SUFFIX(fold_lessthan16bytes)(__m128i x, const u8 *p, size_t len,440warning: libdeflate-sys@1.23.1: | ^~~~~~~~~~~~~~~~~~~~441warning: libdeflate-sys@1.23.1: libdeflate/lib/lib_common.h:102:33: note: in definition of macro 'CONCAT_IMPL'442warning: libdeflate-sys@1.23.1: 102 | #define CONCAT_IMPL(a, b) a##b443warning: libdeflate-sys@1.23.1: | ^444warning: libdeflate-sys@1.23.1: libdeflate/lib/lib_common.h:104:33: note: in expansion of macro 'CONCAT'445warning: libdeflate-sys@1.23.1: 104 | #define ADD_SUFFIX(name) CONCAT(name, SUFFIX)446warning: libdeflate-sys@1.23.1: | ^~~~~~447warning: libdeflate-sys@1.23.1: libdeflate/lib/x86/crc32_pclmul_template.h:160:1: note: in expansion of macro 'ADD_SUFFIX'448warning: libdeflate-sys@1.23.1: 160 | ADD_SUFFIX(fold_lessthan16bytes)(__m128i x, const u8 *p, size_t len,449warning: libdeflate-sys@1.23.1: | ^~~~~~~~~~450warning: libdeflate-sys@1.23.1: libdeflate/lib/x86/crc32_impl.h:105:46: error: attribute 'target' argument 'no-evex512' is unknown451warning: libdeflate-sys@1.23.1: 105 | # define crc32_x86_vpclmulqdq_avx512_vl256 crc32_x86_vpclmulqdq_avx512_vl256452warning: libdeflate-sys@1.23.1: | ^~~~~~~~~~~~~~~~~~~~~~~~~~~~~~~~~453warning: libdeflate-sys@1.23.1: libdeflate/lib/lib_common.h:102:33: note: in expansion of macro 'crc32_x86_vpclmulqdq_avx512_vl256'454warning: libdeflate-sys@1.23.1: 102 | #define CONCAT_IMPL(a, b) a##b455warning: libdeflate-sys@1.23.1: | ^456warning: libdeflate-sys@1.23.1: libdeflate/lib/lib_common.h:103:33: note: in expansion of macro 'CONCAT_IMPL'457warning: libdeflate-sys@1.23.1: 103 | #define CONCAT(a, b) CONCAT_IMPL(a, b)458warning: libdeflate-sys@1.23.1: | ^~~~~~~~~~~459warning: libdeflate-sys@1.23.1: libdeflate/lib/lib_common.h:104:33: note: in expansion of macro 'CONCAT'460warning: libdeflate-sys@1.23.1: 104 | #define ADD_SUFFIX(name) CONCAT(name, SUFFIX)461warning: libdeflate-sys@1.23.1: | ^~~~~~462warning: libdeflate-sys@1.23.1: libdeflate/lib/x86/crc32_pclmul_template.h:184:1: note: in expansion of macro 'ADD_SUFFIX'463warning: libdeflate-sys@1.23.1: 184 | ADD_SUFFIX(crc32_x86)(u32 crc, const u8 *p, size_t len)464warning: libdeflate-sys@1.23.1: | ^~~~~~~~~~465warning: libdeflate-sys@1.23.1: libdeflate/lib/x86/crc32_pclmul_template.h:106:12: error: attribute 'target' argument 'evex512' is unknown466warning: libdeflate-sys@1.23.1: 106 | ADD_SUFFIX(fold_vec128)(__m128i src, __m128i dst, __m128i /* __v2du */ mults)467warning: libdeflate-sys@1.23.1: | ^~~~~~~~~~~468warning: libdeflate-sys@1.23.1: libdeflate/lib/lib_common.h:102:33: note: in definition of macro 'CONCAT_IMPL'469warning: libdeflate-sys@1.23.1: 102 | #define CONCAT_IMPL(a, b) a##b470warning: libdeflate-sys@1.23.1: | ^471warning: libdeflate-sys@1.23.1: libdeflate/lib/lib_common.h:104:33: note: in expansion of macro 'CONCAT'472warning: libdeflate-sys@1.23.1: 104 | #define ADD_SUFFIX(name) CONCAT(name, SUFFIX)473warning: libdeflate-sys@1.23.1: | ^~~~~~474warning: libdeflate-sys@1.23.1: libdeflate/lib/x86/crc32_pclmul_template.h:106:1: note: in expansion of macro 'ADD_SUFFIX'475warning: libdeflate-sys@1.23.1: 106 | ADD_SUFFIX(fold_vec128)(__m128i src, __m128i dst, __m128i /* __v2du */ mults)476warning: libdeflate-sys@1.23.1: | ^~~~~~~~~~477warning: libdeflate-sys@1.23.1: libdeflate/lib/x86/crc32_pclmul_template.h:117:12: error: attribute 'target' argument 'evex512' is unknown478warning: libdeflate-sys@1.23.1: 117 | ADD_SUFFIX(fold_vec256)(__m256i src, __m256i dst, __m256i /* __v4du */ mults)479warning: libdeflate-sys@1.23.1: | ^~~~~~~~~~~480warning: libdeflate-sys@1.23.1: libdeflate/lib/lib_common.h:102:33: note: in definition of macro 'CONCAT_IMPL'481warning: libdeflate-sys@1.23.1: 102 | #define CONCAT_IMPL(a, b) a##b482warning: libdeflate-sys@1.23.1: | ^483warning: libdeflate-sys@1.23.1: libdeflate/lib/lib_common.h:104:33: note: in expansion of macro 'CONCAT'484warning: libdeflate-sys@1.23.1: 104 | #define ADD_SUFFIX(name) CONCAT(name, SUFFIX)485warning: libdeflate-sys@1.23.1: | ^~~~~~486warning: libdeflate-sys@1.23.1: libdeflate/lib/x86/crc32_pclmul_template.h:117:1: note: in expansion of macro 'ADD_SUFFIX'487warning: libdeflate-sys@1.23.1: 117 | ADD_SUFFIX(fold_vec256)(__m256i src, __m256i dst, __m256i /* __v4du */ mults)488warning: libdeflate-sys@1.23.1: | ^~~~~~~~~~489warning: libdeflate-sys@1.23.1: libdeflate/lib/x86/crc32_pclmul_template.h:139:12: error: attribute 'target' argument 'evex512' is unknown490warning: libdeflate-sys@1.23.1: 139 | ADD_SUFFIX(fold_vec512)(__m512i src, __m512i dst, __m512i /* __v8du */ mults)491warning: libdeflate-sys@1.23.1: | ^~~~~~~~~~~492warning: libdeflate-sys@1.23.1: libdeflate/lib/lib_common.h:102:33: note: in definition of macro 'CONCAT_IMPL'493warning: libdeflate-sys@1.23.1: 102 | #define CONCAT_IMPL(a, b) a##b494warning: libdeflate-sys@1.23.1: | ^495warning: libdeflate-sys@1.23.1: libdeflate/lib/lib_common.h:104:33: note: in expansion of macro 'CONCAT'496warning: libdeflate-sys@1.23.1: 104 | #define ADD_SUFFIX(name) CONCAT(name, SUFFIX)497warning: libdeflate-sys@1.23.1: | ^~~~~~498warning: libdeflate-sys@1.23.1: libdeflate/lib/x86/crc32_pclmul_template.h:139:1: note: in expansion of macro 'ADD_SUFFIX'499warning: libdeflate-sys@1.23.1: 139 | ADD_SUFFIX(fold_vec512)(__m512i src, __m512i dst, __m512i /* __v8du */ mults)500warning: libdeflate-sys@1.23.1: | ^~~~~~~~~~501warning: libdeflate-sys@1.23.1: In file included from libdeflate/lib/x86/crc32_impl.h:124:502warning: libdeflate-sys@1.23.1: libdeflate/lib/x86/crc32_pclmul_template.h: In function 'fold_vec512_vpclmulqdq_avx512_vl512':503warning: libdeflate-sys@1.23.1: libdeflate/lib/x86/crc32_pclmul_template.h:140:1: warning: AVX512F vector return without AVX512F enabled changes the ABI [-Wpsabi]504warning: libdeflate-sys@1.23.1: 140 | {505warning: libdeflate-sys@1.23.1: | ^506warning: libdeflate-sys@1.23.1: libdeflate/lib/x86/crc32_pclmul_template.h: At top level:507warning: libdeflate-sys@1.23.1: libdeflate/lib/x86/crc32_pclmul_template.h:160:12: error: attribute 'target' argument 'evex512' is unknown508warning: libdeflate-sys@1.23.1: 160 | ADD_SUFFIX(fold_lessthan16bytes)(__m128i x, const u8 *p, size_t len,509warning: libdeflate-sys@1.23.1: | ^~~~~~~~~~~~~~~~~~~~510warning: libdeflate-sys@1.23.1: libdeflate/lib/lib_common.h:102:33: note: in definition of macro 'CONCAT_IMPL'511warning: libdeflate-sys@1.23.1: 102 | #define CONCAT_IMPL(a, b) a##b512warning: libdeflate-sys@1.23.1: | ^513warning: libdeflate-sys@1.23.1: libdeflate/lib/lib_common.h:104:33: note: in expansion of macro 'CONCAT'514warning: libdeflate-sys@1.23.1: 104 | #define ADD_SUFFIX(name) CONCAT(name, SUFFIX)515warning: libdeflate-sys@1.23.1: | ^~~~~~516warning: libdeflate-sys@1.23.1: libdeflate/lib/x86/crc32_pclmul_template.h:160:1: note: in expansion of macro 'ADD_SUFFIX'517warning: libdeflate-sys@1.23.1: 160 | ADD_SUFFIX(fold_lessthan16bytes)(__m128i x, const u8 *p, size_t len,518warning: libdeflate-sys@1.23.1: | ^~~~~~~~~~519warning: libdeflate-sys@1.23.1: libdeflate/lib/x86/crc32_impl.h:119:46: error: attribute 'target' argument 'evex512' is unknown520warning: libdeflate-sys@1.23.1: 119 | # define crc32_x86_vpclmulqdq_avx512_vl512 crc32_x86_vpclmulqdq_avx512_vl512521warning: libdeflate-sys@1.23.1: | ^~~~~~~~~~~~~~~~~~~~~~~~~~~~~~~~~522warning: libdeflate-sys@1.23.1: libdeflate/lib/lib_common.h:102:33: note: in expansion of macro 'crc32_x86_vpclmulqdq_avx512_vl512'523warning: libdeflate-sys@1.23.1: 102 | #define CONCAT_IMPL(a, b) a##b524warning: libdeflate-sys@1.23.1: | ^525warning: libdeflate-sys@1.23.1: libdeflate/lib/lib_common.h:103:33: note: in expansion of macro 'CONCAT_IMPL'526warning: libdeflate-sys@1.23.1: 103 | #define CONCAT(a, b) CONCAT_IMPL(a, b)527warning: libdeflate-sys@1.23.1: | ^~~~~~~~~~~528warning: libdeflate-sys@1.23.1: libdeflate/lib/lib_common.h:104:33: note: in expansion of macro 'CONCAT'529warning: libdeflate-sys@1.23.1: 104 | #define ADD_SUFFIX(name) CONCAT(name, SUFFIX)530warning: libdeflate-sys@1.23.1: | ^~~~~~531warning: libdeflate-sys@1.23.1: libdeflate/lib/x86/crc32_pclmul_template.h:184:1: note: in expansion of macro 'ADD_SUFFIX'532warning: libdeflate-sys@1.23.1: 184 | ADD_SUFFIX(crc32_x86)(u32 crc, const u8 *p, size_t len)533warning: libdeflate-sys@1.23.1: | ^~~~~~~~~~534warning: libdeflate-sys@1.23.1: libdeflate/lib/x86/crc32_pclmul_template.h: In function 'fold_vec256_vpclmulqdq_avx512_vl256':535warning: libdeflate-sys@1.23.1: libdeflate/lib/x86/crc32_pclmul_template.h:117:12: note: the ABI for passing parameters with 32-byte alignment has changed in GCC 4.6536warning: libdeflate-sys@1.23.1: 117 | ADD_SUFFIX(fold_vec256)(__m256i src, __m256i dst, __m256i /* __v4du */ mults)537warning: libdeflate-sys@1.23.1: | ^~~~~~~~~~~538warning: libdeflate-sys@1.23.1: libdeflate/lib/lib_common.h:102:33: note: in definition of macro 'CONCAT_IMPL'539warning: libdeflate-sys@1.23.1: 102 | #define CONCAT_IMPL(a, b) a##b540warning: libdeflate-sys@1.23.1: | ^541warning: libdeflate-sys@1.23.1: libdeflate/lib/lib_common.h:104:33: note: in expansion of macro 'CONCAT'542warning: libdeflate-sys@1.23.1: 104 | #define ADD_SUFFIX(name) CONCAT(name, SUFFIX)543warning: libdeflate-sys@1.23.1: | ^~~~~~544warning: libdeflate-sys@1.23.1: libdeflate/lib/x86/crc32_pclmul_template.h:117:1: note: in expansion of macro 'ADD_SUFFIX'545warning: libdeflate-sys@1.23.1: 117 | ADD_SUFFIX(fold_vec256)(__m256i src, __m256i dst, __m256i /* __v4du */ mults)546warning: libdeflate-sys@1.23.1: | ^~~~~~~~~~547warning: libdeflate-sys@1.23.1: ToolExecError: command did not execute successfully (status code exit status: 1): LC_ALL="C" "/nix/store/j1938gsbvbhkyz4kbmvjk56r479mkw3s-gcc-wrapper-16.2.0/bin/cc" "-O3" "-ffunction-sections" "-fdata-sections" "-fPIC" "-m64" "-I" "libdeflate" "-fno-omit-frame-pointer" "-o" "/build/source/target/x86_64-unknown-linux-gnu/release/build/libdeflate-sys-e17dcf852e22f5bb/out/lib/81d37bb229f1c0d9-crc32.o" "-c" "libdeflate/lib/crc32.c"548error: failed to run custom build command for `libdeflate-sys v1.23.1`549550Caused by:551 process didn't exit successfully: `/build/source/target/release/build/libdeflate-sys-96b6fd7c63bb3028/build-script-build` (exit status: 1)552 --- stdout553 OPT_LEVEL = Some(3)554 TARGET = Some(x86_64-unknown-linux-gnu)555 HOST = Some(x86_64-unknown-linux-gnu)556 cargo:rerun-if-env-changed=CC_x86_64-unknown-linux-gnu557 CC_x86_64-unknown-linux-gnu = None558 cargo:rerun-if-env-changed=CC_x86_64_unknown_linux_gnu559 CC_x86_64_unknown_linux_gnu = None560 cargo:rerun-if-env-changed=HOST_CC561 HOST_CC = Some(/nix/store/j1938gsbvbhkyz4kbmvjk56r479mkw3s-gcc-wrapper-16.2.0/bin/cc)562 RUSTC_WRAPPER = None563 cargo:rerun-if-env-changed=CC_ENABLE_DEBUG_OUTPUT564 cargo:rerun-if-env-changed=CRATE_CC_NO_DEFAULTS565 CRATE_CC_NO_DEFAULTS = None566 DEBUG = Some(false)567 CARGO_CFG_TARGET_FEATURE = Some(fxsr,sse,sse2)568 cargo:rerun-if-env-changed=CFLAGS569 CFLAGS = None570 cargo:rerun-if-env-changed=HOST_CFLAGS571 HOST_CFLAGS = None572 cargo:rerun-if-env-changed=CFLAGS_x86_64_unknown_linux_gnu573 CFLAGS_x86_64_unknown_linux_gnu = None574 cargo:rerun-if-env-changed=CFLAGS_x86_64-unknown-linux-gnu575 CFLAGS_x86_64-unknown-linux-gnu = None576 CARGO_ENCODED_RUSTFLAGS = Some(-Cforce-frame-pointers=yes)577 OUT_DIR = Some(/build/source/target/x86_64-unknown-linux-gnu/release/build/libdeflate-sys-e17dcf852e22f5bb/out)578 cargo:rerun-if-env-changed=CC_ENABLE_DEBUG_OUTPUT579 cargo:rerun-if-env-changed=CRATE_CC_NO_DEFAULTS580 CRATE_CC_NO_DEFAULTS = None581 TARGET = Some(x86_64-unknown-linux-gnu)582 CARGO_CFG_TARGET_FEATURE = Some(fxsr,sse,sse2)583 HOST = Some(x86_64-unknown-linux-gnu)584 cargo:rerun-if-env-changed=CFLAGS585 CFLAGS = None586 cargo:rerun-if-env-changed=HOST_CFLAGS587 HOST_CFLAGS = None588 cargo:rerun-if-env-changed=CFLAGS_x86_64_unknown_linux_gnu589 CFLAGS_x86_64_unknown_linux_gnu = None590 cargo:rerun-if-env-changed=CFLAGS_x86_64-unknown-linux-gnu591 CFLAGS_x86_64-unknown-linux-gnu = None592 cargo:warning=In file included from libdeflate/lib/adler32.c:28:593 cargo:warning=libdeflate/lib/x86/adler32_template.h:135:12: error: attribute 'target' argument 'no-evex512' is unknown594 cargo:warning= 135 | ADD_SUFFIX(reduce_to_32bits)(vec_t v_s1, vec_t v_s2, u32 *s1_p, u32 *s2_p)595 cargo:warning= | ^~~~~~~~~~~~~~~~596 cargo:warning=libdeflate/lib/lib_common.h:102:33: note: in definition of macro 'CONCAT_IMPL'597 cargo:warning= 102 | #define CONCAT_IMPL(a, b) a##b598 cargo:warning= | ^599 cargo:warning=libdeflate/lib/lib_common.h:104:33: note: in expansion of macro 'CONCAT'600 cargo:warning= 104 | #define ADD_SUFFIX(name) CONCAT(name, SUFFIX)601 cargo:warning= | ^~~~~~602 cargo:warning=libdeflate/lib/x86/adler32_template.h:135:1: note: in expansion of macro 'ADD_SUFFIX'603 cargo:warning= 135 | ADD_SUFFIX(reduce_to_32bits)(vec_t v_s1, vec_t v_s2, u32 *s1_p, u32 *s2_p)604 cargo:warning= | ^~~~~~~~~~605 cargo:warning=In file included from libdeflate/lib/adler32.c:128:606 cargo:warning=libdeflate/lib/x86/adler32_impl.h:83:41: error: attribute 'target' argument 'no-evex512' is unknown607 cargo:warning= 83 | # define adler32_x86_avx512_vl256_vnni adler32_x86_avx512_vl256_vnni608 cargo:warning= | ^~~~~~~~~~~~~~~~~~~~~~~~~~~~~609 cargo:warning=libdeflate/lib/lib_common.h:102:33: note: in expansion of macro 'adler32_x86_avx512_vl256_vnni'610 cargo:warning= 102 | #define CONCAT_IMPL(a, b) a##b611 cargo:warning= | ^612 cargo:warning=libdeflate/lib/lib_common.h:103:33: note: in expansion of macro 'CONCAT_IMPL'613 cargo:warning= 103 | #define CONCAT(a, b) CONCAT_IMPL(a, b)614 cargo:warning= | ^~~~~~~~~~~615 cargo:warning=libdeflate/lib/lib_common.h:104:33: note: in expansion of macro 'CONCAT'616 cargo:warning= 104 | #define ADD_SUFFIX(name) CONCAT(name, SUFFIX)617 cargo:warning= | ^~~~~~618 cargo:warning=libdeflate/lib/x86/adler32_template.h:183:1: note: in expansion of macro 'ADD_SUFFIX'619 cargo:warning= 183 | ADD_SUFFIX(adler32_x86)(u32 adler, const u8 *p, size_t len)620 cargo:warning= | ^~~~~~~~~~621 cargo:warning=libdeflate/lib/x86/adler32_template.h:135:12: error: attribute 'target' argument 'evex512' is unknown622 cargo:warning= 135 | ADD_SUFFIX(reduce_to_32bits)(vec_t v_s1, vec_t v_s2, u32 *s1_p, u32 *s2_p)623 cargo:warning= | ^~~~~~~~~~~~~~~~624 cargo:warning=libdeflate/lib/lib_common.h:102:33: note: in definition of macro 'CONCAT_IMPL'625 cargo:warning= 102 | #define CONCAT_IMPL(a, b) a##b626 cargo:warning= | ^627 cargo:warning=libdeflate/lib/lib_common.h:104:33: note: in expansion of macro 'CONCAT'628 cargo:warning= 104 | #define ADD_SUFFIX(name) CONCAT(name, SUFFIX)629 cargo:warning= | ^~~~~~630 cargo:warning=libdeflate/lib/x86/adler32_template.h:135:1: note: in expansion of macro 'ADD_SUFFIX'631 cargo:warning= 135 | ADD_SUFFIX(reduce_to_32bits)(vec_t v_s1, vec_t v_s2, u32 *s1_p, u32 *s2_p)632 cargo:warning= | ^~~~~~~~~~633 cargo:warning=libdeflate/lib/x86/adler32_impl.h:96:41: error: attribute 'target' argument 'evex512' is unknown634 cargo:warning= 96 | # define adler32_x86_avx512_vl512_vnni adler32_x86_avx512_vl512_vnni635 cargo:warning= | ^~~~~~~~~~~~~~~~~~~~~~~~~~~~~636 cargo:warning=libdeflate/lib/lib_common.h:102:33: note: in expansion of macro 'adler32_x86_avx512_vl512_vnni'637 cargo:warning= 102 | #define CONCAT_IMPL(a, b) a##b638 cargo:warning= | ^639 cargo:warning=libdeflate/lib/lib_common.h:103:33: note: in expansion of macro 'CONCAT_IMPL'640 cargo:warning= 103 | #define CONCAT(a, b) CONCAT_IMPL(a, b)641 cargo:warning= | ^~~~~~~~~~~642 cargo:warning=libdeflate/lib/lib_common.h:104:33: note: in expansion of macro 'CONCAT'643 cargo:warning= 104 | #define ADD_SUFFIX(name) CONCAT(name, SUFFIX)644 cargo:warning= | ^~~~~~645 cargo:warning=libdeflate/lib/x86/adler32_template.h:183:1: note: in expansion of macro 'ADD_SUFFIX'646 cargo:warning= 183 | ADD_SUFFIX(adler32_x86)(u32 adler, const u8 *p, size_t len)647 cargo:warning= | ^~~~~~~~~~648 cargo:warning=In file included from libdeflate/lib/x86/adler32_impl.h:89:649 cargo:warning=libdeflate/lib/x86/adler32_template.h: In function 'adler32_x86_avx512_vl256_vnni':650 cargo:warning=libdeflate/lib/x86/adler32_template.h:197:21: warning: AVX vector return without AVX enabled changes the ABI [-Wpsabi]651 cargo:warning= 197 | const vec_t ones = VSET1_8(1);652 cargo:warning= | ^~~~653 cargo:warning=libdeflate/lib/x86/adler32_template.h: In function 'reduce_to_32bits_avx512_vl256_vnni':654 cargo:warning=libdeflate/lib/x86/adler32_template.h:135:12: note: the ABI for passing parameters with 32-byte alignment has changed in GCC 4.6655 cargo:warning= 135 | ADD_SUFFIX(reduce_to_32bits)(vec_t v_s1, vec_t v_s2, u32 *s1_p, u32 *s2_p)656 cargo:warning= | ^~~~~~~~~~~~~~~~657 cargo:warning=libdeflate/lib/lib_common.h:102:33: note: in definition of macro 'CONCAT_IMPL'658 cargo:warning= 102 | #define CONCAT_IMPL(a, b) a##b659 cargo:warning= | ^660 cargo:warning=libdeflate/lib/lib_common.h:104:33: note: in expansion of macro 'CONCAT'661 cargo:warning= 104 | #define ADD_SUFFIX(name) CONCAT(name, SUFFIX)662 cargo:warning= | ^~~~~~663 cargo:warning=libdeflate/lib/x86/adler32_template.h:135:1: note: in expansion of macro 'ADD_SUFFIX'664 cargo:warning= 135 | ADD_SUFFIX(reduce_to_32bits)(vec_t v_s1, vec_t v_s2, u32 *s1_p, u32 *s2_p)665 cargo:warning= | ^~~~~~~~~~666 cargo:warning=In file included from libdeflate/lib/x86/adler32_impl.h:102:667 cargo:warning=libdeflate/lib/x86/adler32_template.h: In function 'adler32_x86_avx512_vl512_vnni':668 cargo:warning=libdeflate/lib/x86/adler32_template.h:197:21: warning: AVX512F vector return without AVX512F enabled changes the ABI [-Wpsabi]669 cargo:warning= 197 | const vec_t ones = VSET1_8(1);670 cargo:warning= | ^~~~671 exit status: 0672 exit status: 0673 exit status: 0674 exit status: 0675 exit status: 0676 exit status: 0677 exit status: 0678 exit status: 1679 cargo:warning=ToolExecError: command did not execute successfully (status code exit status: 1): LC_ALL="C" "/nix/store/j1938gsbvbhkyz4kbmvjk56r479mkw3s-gcc-wrapper-16.2.0/bin/cc" "-O3" "-ffunction-sections" "-fdata-sections" "-fPIC" "-m64" "-I" "libdeflate" "-fno-omit-frame-pointer" "-o" "/build/source/target/x86_64-unknown-linux-gnu/release/build/libdeflate-sys-e17dcf852e22f5bb/out/lib/81d37bb229f1c0d9-adler32.o" "-c" "libdeflate/lib/adler32.c"cargo:warning=In file included from libdeflate/lib/crc32.c:171:680 cargo:warning=libdeflate/lib/x86/crc32_pclmul_template.h:106:12: error: attribute 'target' argument 'no-evex512' is unknown681 cargo:warning= 106 | ADD_SUFFIX(fold_vec128)(__m128i src, __m128i dst, __m128i /* __v2du */ mults)682 cargo:warning= | ^~~~~~~~~~~683 cargo:warning=libdeflate/lib/lib_common.h:102:33: note: in definition of macro 'CONCAT_IMPL'684 cargo:warning= 102 | #define CONCAT_IMPL(a, b) a##b685 cargo:warning= | ^686 cargo:warning=libdeflate/lib/lib_common.h:104:33: note: in expansion of macro 'CONCAT'687 cargo:warning= 104 | #define ADD_SUFFIX(name) CONCAT(name, SUFFIX)688 cargo:warning= | ^~~~~~689 cargo:warning=libdeflate/lib/x86/crc32_pclmul_template.h:106:1: note: in expansion of macro 'ADD_SUFFIX'690 cargo:warning= 106 | ADD_SUFFIX(fold_vec128)(__m128i src, __m128i dst, __m128i /* __v2du */ mults)691 cargo:warning= | ^~~~~~~~~~692 cargo:warning=libdeflate/lib/x86/crc32_pclmul_template.h:117:12: error: attribute 'target' argument 'no-evex512' is unknown693 cargo:warning= 117 | ADD_SUFFIX(fold_vec256)(__m256i src, __m256i dst, __m256i /* __v4du */ mults)694 cargo:warning= | ^~~~~~~~~~~695 cargo:warning=libdeflate/lib/lib_common.h:102:33: note: in definition of macro 'CONCAT_IMPL'696 cargo:warning= 102 | #define CONCAT_IMPL(a, b) a##b697 cargo:warning= | ^698 cargo:warning=libdeflate/lib/lib_common.h:104:33: note: in expansion of macro 'CONCAT'699 cargo:warning= 104 | #define ADD_SUFFIX(name) CONCAT(name, SUFFIX)700 cargo:warning= | ^~~~~~701 cargo:warning=libdeflate/lib/x86/crc32_pclmul_template.h:117:1: note: in expansion of macro 'ADD_SUFFIX'702 cargo:warning= 117 | ADD_SUFFIX(fold_vec256)(__m256i src, __m256i dst, __m256i /* __v4du */ mults)703 cargo:warning= | ^~~~~~~~~~704 cargo:warning=In file included from libdeflate/lib/x86/crc32_impl.h:110,705 cargo:warning= from libdeflate/lib/crc32.c:228:706 cargo:warning=libdeflate/lib/x86/crc32_pclmul_template.h: In function 'fold_vec256_vpclmulqdq_avx512_vl256':707 cargo:warning=libdeflate/lib/x86/crc32_pclmul_template.h:118:1: warning: AVX vector return without AVX enabled changes the ABI [-Wpsabi]708 cargo:warning= 118 | {709 cargo:warning= | ^710 cargo:warning=libdeflate/lib/x86/crc32_pclmul_template.h: At top level:711 cargo:warning=libdeflate/lib/x86/crc32_pclmul_template.h:160:12: error: attribute 'target' argument 'no-evex512' is unknown712 cargo:warning= 160 | ADD_SUFFIX(fold_lessthan16bytes)(__m128i x, const u8 *p, size_t len,713 cargo:warning= | ^~~~~~~~~~~~~~~~~~~~714 cargo:warning=libdeflate/lib/lib_common.h:102:33: note: in definition of macro 'CONCAT_IMPL'715 cargo:warning= 102 | #define CONCAT_IMPL(a, b) a##b716 cargo:warning= | ^717 cargo:warning=libdeflate/lib/lib_common.h:104:33: note: in expansion of macro 'CONCAT'718 cargo:warning= 104 | #define ADD_SUFFIX(name) CONCAT(name, SUFFIX)719 cargo:warning= | ^~~~~~720 cargo:warning=libdeflate/lib/x86/crc32_pclmul_template.h:160:1: note: in expansion of macro 'ADD_SUFFIX'721 cargo:warning= 160 | ADD_SUFFIX(fold_lessthan16bytes)(__m128i x, const u8 *p, size_t len,722 cargo:warning= | ^~~~~~~~~~723 cargo:warning=libdeflate/lib/x86/crc32_impl.h:105:46: error: attribute 'target' argument 'no-evex512' is unknown724 cargo:warning= 105 | # define crc32_x86_vpclmulqdq_avx512_vl256 crc32_x86_vpclmulqdq_avx512_vl256725 cargo:warning= | ^~~~~~~~~~~~~~~~~~~~~~~~~~~~~~~~~726 cargo:warning=libdeflate/lib/lib_common.h:102:33: note: in expansion of macro 'crc32_x86_vpclmulqdq_avx512_vl256'727 cargo:warning= 102 | #define CONCAT_IMPL(a, b) a##b728 cargo:warning= | ^729 cargo:warning=libdeflate/lib/lib_common.h:103:33: note: in expansion of macro 'CONCAT_IMPL'730 cargo:warning= 103 | #define CONCAT(a, b) CONCAT_IMPL(a, b)731 cargo:warning= | ^~~~~~~~~~~732 cargo:warning=libdeflate/lib/lib_common.h:104:33: note: in expansion of macro 'CONCAT'733 cargo:warning= 104 | #define ADD_SUFFIX(name) CONCAT(name, SUFFIX)734 cargo:warning= | ^~~~~~735 cargo:warning=libdeflate/lib/x86/crc32_pclmul_template.h:184:1: note: in expansion of macro 'ADD_SUFFIX'736 cargo:warning= 184 | ADD_SUFFIX(crc32_x86)(u32 crc, const u8 *p, size_t len)737 cargo:warning= | ^~~~~~~~~~738 cargo:warning=libdeflate/lib/x86/crc32_pclmul_template.h:106:12: error: attribute 'target' argument 'evex512' is unknown739 cargo:warning= 106 | ADD_SUFFIX(fold_vec128)(__m128i src, __m128i dst, __m128i /* __v2du */ mults)740 cargo:warning= | ^~~~~~~~~~~741 cargo:warning=libdeflate/lib/lib_common.h:102:33: note: in definition of macro 'CONCAT_IMPL'742 cargo:warning= 102 | #define CONCAT_IMPL(a, b) a##b743 cargo:warning= | ^744 cargo:warning=libdeflate/lib/lib_common.h:104:33: note: in expansion of macro 'CONCAT'745 cargo:warning= 104 | #define ADD_SUFFIX(name) CONCAT(name, SUFFIX)746 cargo:warning= | ^~~~~~747 cargo:warning=libdeflate/lib/x86/crc32_pclmul_template.h:106:1: note: in expansion of macro 'ADD_SUFFIX'748 cargo:warning= 106 | ADD_SUFFIX(fold_vec128)(__m128i src, __m128i dst, __m128i /* __v2du */ mults)749 cargo:warning= | ^~~~~~~~~~750 cargo:warning=libdeflate/lib/x86/crc32_pclmul_template.h:117:12: error: attribute 'target' argument 'evex512' is unknown751 cargo:warning= 117 | ADD_SUFFIX(fold_vec256)(__m256i src, __m256i dst, __m256i /* __v4du */ mults)752 cargo:warning= | ^~~~~~~~~~~753 cargo:warning=libdeflate/lib/lib_common.h:102:33: note: in definition of macro 'CONCAT_IMPL'754 cargo:warning= 102 | #define CONCAT_IMPL(a, b) a##b755 cargo:warning= | ^756 cargo:warning=libdeflate/lib/lib_common.h:104:33: note: in expansion of macro 'CONCAT'757 cargo:warning= 104 | #define ADD_SUFFIX(name) CONCAT(name, SUFFIX)758 cargo:warning= | ^~~~~~759 cargo:warning=libdeflate/lib/x86/crc32_pclmul_template.h:117:1: note: in expansion of macro 'ADD_SUFFIX'760 cargo:warning= 117 | ADD_SUFFIX(fold_vec256)(__m256i src, __m256i dst, __m256i /* __v4du */ mults)761 cargo:warning= | ^~~~~~~~~~762 cargo:warning=libdeflate/lib/x86/crc32_pclmul_template.h:139:12: error: attribute 'target' argument 'evex512' is unknown763 cargo:warning= 139 | ADD_SUFFIX(fold_vec512)(__m512i src, __m512i dst, __m512i /* __v8du */ mults)764 cargo:warning= | ^~~~~~~~~~~765 cargo:warning=libdeflate/lib/lib_common.h:102:33: note: in definition of macro 'CONCAT_IMPL'766 cargo:warning= 102 | #define CONCAT_IMPL(a, b) a##b767 cargo:warning= | ^768 cargo:warning=libdeflate/lib/lib_common.h:104:33: note: in expansion of macro 'CONCAT'769 cargo:warning= 104 | #define ADD_SUFFIX(name) CONCAT(name, SUFFIX)770 cargo:warning= | ^~~~~~771 cargo:warning=libdeflate/lib/x86/crc32_pclmul_template.h:139:1: note: in expansion of macro 'ADD_SUFFIX'772 cargo:warning= 139 | ADD_SUFFIX(fold_vec512)(__m512i src, __m512i dst, __m512i /* __v8du */ mults)773 cargo:warning= | ^~~~~~~~~~774 cargo:warning=In file included from libdeflate/lib/x86/crc32_impl.h:124:775 cargo:warning=libdeflate/lib/x86/crc32_pclmul_template.h: In function 'fold_vec512_vpclmulqdq_avx512_vl512':776 cargo:warning=libdeflate/lib/x86/crc32_pclmul_template.h:140:1: warning: AVX512F vector return without AVX512F enabled changes the ABI [-Wpsabi]777 cargo:warning= 140 | {778 cargo:warning= | ^779 cargo:warning=libdeflate/lib/x86/crc32_pclmul_template.h: At top level:780 cargo:warning=libdeflate/lib/x86/crc32_pclmul_template.h:160:12: error: attribute 'target' argument 'evex512' is unknown781 cargo:warning= 160 | ADD_SUFFIX(fold_lessthan16bytes)(__m128i x, const u8 *p, size_t len,782 cargo:warning= | ^~~~~~~~~~~~~~~~~~~~783 cargo:warning=libdeflate/lib/lib_common.h:102:33: note: in definition of macro 'CONCAT_IMPL'784 cargo:warning= 102 | #define CONCAT_IMPL(a, b) a##b785 cargo:warning= | ^786 cargo:warning=libdeflate/lib/lib_common.h:104:33: note: in expansion of macro 'CONCAT'787 cargo:warning= 104 | #define ADD_SUFFIX(name) CONCAT(name, SUFFIX)788 cargo:warning= | ^~~~~~789 cargo:warning=libdeflate/lib/x86/crc32_pclmul_template.h:160:1: note: in expansion of macro 'ADD_SUFFIX'790 cargo:warning= 160 | ADD_SUFFIX(fold_lessthan16bytes)(__m128i x, const u8 *p, size_t len,791 cargo:warning= | ^~~~~~~~~~792 cargo:warning=libdeflate/lib/x86/crc32_impl.h:119:46: error: attribute 'target' argument 'evex512' is unknown793 cargo:warning= 119 | # define crc32_x86_vpclmulqdq_avx512_vl512 crc32_x86_vpclmulqdq_avx512_vl512794 cargo:warning= | ^~~~~~~~~~~~~~~~~~~~~~~~~~~~~~~~~795 cargo:warning=libdeflate/lib/lib_common.h:102:33: note: in expansion of macro 'crc32_x86_vpclmulqdq_avx512_vl512'796 cargo:warning= 102 | #define CONCAT_IMPL(a, b) a##b797 cargo:warning= | ^798 cargo:warning=libdeflate/lib/lib_common.h:103:33: note: in expansion of macro 'CONCAT_IMPL'799 cargo:warning= 103 | #define CONCAT(a, b) CONCAT_IMPL(a, b)800 cargo:warning= | ^~~~~~~~~~~801 cargo:warning=libdeflate/lib/lib_common.h:104:33: note: in expansion of macro 'CONCAT'802 cargo:warning= 104 | #define ADD_SUFFIX(name) CONCAT(name, SUFFIX)803 cargo:warning= | ^~~~~~804 cargo:warning=libdeflate/lib/x86/crc32_pclmul_template.h:184:1: note: in expansion of macro 'ADD_SUFFIX'805 cargo:warning= 184 | ADD_SUFFIX(crc32_x86)(u32 crc, const u8 *p, size_t len)806 cargo:warning= | ^~~~~~~~~~807 cargo:warning=libdeflate/lib/x86/crc32_pclmul_template.h: In function 'fold_vec256_vpclmulqdq_avx512_vl256':808 cargo:warning=libdeflate/lib/x86/crc32_pclmul_template.h:117:12: note: the ABI for passing parameters with 32-byte alignment has changed in GCC 4.6809 cargo:warning= 117 | ADD_SUFFIX(fold_vec256)(__m256i src, __m256i dst, __m256i /* __v4du */ mults)810 cargo:warning= | ^~~~~~~~~~~811 cargo:warning=libdeflate/lib/lib_common.h:102:33: note: in definition of macro 'CONCAT_IMPL'812 cargo:warning= 102 | #define CONCAT_IMPL(a, b) a##b813 cargo:warning= | ^814 cargo:warning=libdeflate/lib/lib_common.h:104:33: note: in expansion of macro 'CONCAT'815 cargo:warning= 104 | #define ADD_SUFFIX(name) CONCAT(name, SUFFIX)816 cargo:warning= | ^~~~~~817 cargo:warning=libdeflate/lib/x86/crc32_pclmul_template.h:117:1: note: in expansion of macro 'ADD_SUFFIX'818 cargo:warning= 117 | ADD_SUFFIX(fold_vec256)(__m256i src, __m256i dst, __m256i /* __v4du */ mults)819 cargo:warning= | ^~~~~~~~~~820821 exit status: 1822 cargo:warning=ToolExecError: command did not execute successfully (status code exit status: 1): LC_ALL="C" "/nix/store/j1938gsbvbhkyz4kbmvjk56r479mkw3s-gcc-wrapper-16.2.0/bin/cc" "-O3" "-ffunction-sections" "-fdata-sections" "-fPIC" "-m64" "-I" "libdeflate" "-fno-omit-frame-pointer" "-o" "/build/source/target/x86_64-unknown-linux-gnu/release/build/libdeflate-sys-e17dcf852e22f5bb/out/lib/81d37bb229f1c0d9-crc32.o" "-c" "libdeflate/lib/crc32.c"823 exit status: 0824 exit status: 0825826 --- stderr827828829 error occurred in cc-rs: command did not execute successfully (status code exit status: 1): LC_ALL="C" "/nix/store/j1938gsbvbhkyz4kbmvjk56r479mkw3s-gcc-wrapper-16.2.0/bin/cc" "-O3" "-ffunction-sections" "-fdata-sections" "-fPIC" "-m64" "-I" "libdeflate" "-fno-omit-frame-pointer" "-o" "/build/source/target/x86_64-unknown-linux-gnu/release/build/libdeflate-sys-e17dcf852e22f5bb/out/lib/81d37bb229f1c0d9-crc32.o" "-c" "libdeflate/lib/crc32.c"830831832warning: build failed, waiting for other jobs to finish...